program: Gaussian 09
title: 000019632
version: EM64L-G09RevD.01
frameworkgroup: C1[X(C23H29N3O3)]
method: RPBEPBE
basis: SDD
operation: Freq
keyword: #p
keyword: freq=noraman
keyword: PBEPBE/SDD
title: #p freq=noraman PBEPBE/SDD
converged: YES YES NO NO
title: Mulliken charges:
elementType: O O O N N N C C C C C C C C C C C C C C C C C C C C C C C H H H H H H H H H H H H H H H H H H H H H H H H H H H H H
charge: -0.255605 -0.262648 -0.246726 -0.104342 -0.305219 -0.490326 -0.354068 -0.328424 -0.331921 -0.388025 -0.674185 -0.673810 0.103035 0.343501 -0.505172 0.423462 0.156938 -0.305262 -0.405061 0.258610 -0.383305 -0.379219 0.310713 -0.347758 -0.368206 -0.224825 -0.232657 -0.226609 -0.536504 0.206400 0.244686 0.202694 0.187932 0.200204 0.186902 0.262443 0.211501 0.208737 0.227321 0.204227 0.234181 0.223553 0.199588 0.317278 0.224231 0.311924 0.264780 0.227510 0.254460 0.240643 0.271866 0.233666 0.232777 0.230884 0.232890 0.247034 0.221337 0.221971
chargesum: 0.00000
title: Mulliken charges with hydrogens summed into heavy atoms:
elementType: O O O N N N C C C C C C C C C C C C C C C C C C C C C C C
charge: -0.255605 -0.262648 -0.246726 -0.104342 0.012059 -0.178402 0.097018 0.062202 0.055185 0.085919 -0.033901 -0.016488 0.103035 0.343501 -0.280941 0.423462 0.156938 -0.040483 -0.177552 0.258610 -0.128845 -0.138576 0.310713 -0.075892 -0.134541 0.007953 -0.001773 0.006280 0.153838
polarizability: 4.66046831e+02 6.42394282e+01 2.92764088e+02 3.54944244e+00 -6.34039580e+00 2.09725483e+02
1716.lowfreq: -5.9367 -1.7733 -0.0002 0.0006 0.0008 2.5143 14.4176 19.0821 22.6317
frequency: 14.3459 18.8636 22.5710 25.6777 29.4528 31.0788 43.4612 52.7938 62.2587 66.7795 74.8935 86.2424 94.1362 107.8498 118.7202 134.2766 141.0603 170.6310 176.7109 185.3205 201.7870 211.9218 239.4083 242.4410 264.4011 274.2738 285.9854 292.4275 308.3947 311.9789 366.7054 388.3205 392.8497 403.3837 410.8473 416.7653 427.0394 451.4995 464.0638 493.6134 505.4839 522.6746 534.5301 568.1621 585.3718 600.8163 614.7775 625.8214 641.9665 662.1673 688.2849 703.8995 722.1817 731.9530 747.9884 762.0347 768.9832 791.4045 794.4926 799.9955 806.0041 825.6706 840.8481 854.9853 859.0438 870.4450 895.4378 917.6672 937.0988 939.5982 965.4893 984.4681 986.6412 986.6519 989.9206 1001.4923 1005.0332 1008.3739 1024.5579 1048.5387 1071.4103 1075.4088 1077.5357 1079.7402 1086.0302 1093.5483 1112.3192 1119.1763 1124.0921 1158.2560 1173.9848 1181.7124 1183.2181 1189.1125 1198.1373 1209.7622 1226.8103 1240.7595 1252.3994 1257.8511 1259.7932 1286.5148 1290.1544 1298.0154 1313.0887 1317.5885 1324.9881 1352.1761 1361.6461 1365.6511 1376.2445 1379.6443 1384.4766 1385.0006 1390.0470 1427.3792 1433.2271 1436.3340 1447.3574 1461.0914 1461.9946 1463.4382 1466.8593 1470.1094 1472.9796 1478.8717 1483.0405 1486.5138 1490.2428 1492.5561 1492.7822 1504.9165 1568.7949 1575.6507 1595.4300 1606.1407 1610.0054 1619.2320 1622.9251 2845.4807 2856.4384 2900.2147 2959.8901 2981.5108 2981.9488 3013.5406 3018.0237 3029.5208 3048.0497 3053.1616 3069.6386 3073.3542 3075.4788 3087.5694 3090.8243 3091.1461 3119.3249 3121.1577 3126.7261 3132.3733 3145.2521 3152.4933 3157.6977 3162.0632 3169.3798 3172.9063 3537.0331 3560.7553
redmass: 4.4129 3.7845 4.0854 4.6590 4.2681 4.2314 3.7271 3.6312 3.2408 4.0521 4.1277 4.5477 2.2448 4.7555 4.4250 5.4542 2.4320 2.7463 4.6875 3.9441 2.1012 1.3060 1.6539 1.5036 2.3349 4.5955 2.8209 2.5108 3.0597 5.9626 5.0828 3.9122 3.2836 2.8351 4.5851 3.0995 4.3201 2.7263 4.1201 4.4453 3.0463 2.2474 1.5375 3.0792 1.4780 3.3090 5.8684 5.3750 5.8207 6.8759 5.2731 1.5580 3.5759 5.0378 2.0157 1.9651 4.5761 2.3107 1.2165 1.2160 1.4296 1.7895 2.0980 1.7081 1.7172 2.0776 3.8219 1.9496 1.4469 1.4062 1.3616 1.5084 3.6134 3.7491 4.3754 2.6620 1.3788 4.1719 2.4676 3.1374 1.9424 2.4869 2.0926 2.0499 2.0025 2.2550 1.2597 1.4333 1.7364 1.3321 1.0586 1.7799 1.2931 1.1201 2.5174 2.2792 1.8745 2.5864 3.0400 2.5489 1.4201 1.2243 1.2361 1.1392 1.3396 1.3327 1.2920 3.1463 1.3410 1.3331 1.3379 2.8060 1.2399 9.1347 1.2309 3.6597 2.0784 1.2124 1.1355 1.3998 1.2317 1.0645 1.0501 1.0616 1.0829 1.0637 2.1895 1.0589 1.3768 1.0766 1.4307 2.5169 6.8759 6.3261 7.2358 7.0434 6.0781 6.3337 7.3567 1.0717 1.0715 1.0703 1.0330 1.0357 1.0358 1.0871 1.0596 1.0872 1.1039 1.0898 1.0878 1.0987 1.0983 1.1056 1.1003 1.1003 1.0892 1.0871 1.0993 1.0872 1.0921 1.0879 1.0958 1.0937 1.1010 1.0972 1.0767 1.0784
irintensity: 0.3075 0.7090 0.4550 0.4636 1.9595 0.9509 0.8298 4.4930 1.8469 3.4000 2.9972 2.9743 0.0956 4.4734 1.7018 0.3893 2.5958 1.9300 0.1810 5.3795 1.6811 0.3740 0.2429 2.1691 3.2562 17.8653 4.0147 1.8581 3.3343 5.9203 8.6659 1.9273 6.6888 1.0364 4.4816 0.3462 7.3311 6.0167 21.3585 31.2393 6.8540 20.9137 24.6438 25.3272 76.3020 16.3825 1.4788 4.9063 3.3659 4.5284 20.4908 93.5280 6.0439 21.1419 4.7740 3.6409 0.4671 17.1246 6.8535 11.3704 13.5968 3.9274 40.7021 9.2762 22.2823 31.2478 21.3079 1.4566 2.1694 1.7931 0.9385 2.8706 41.0820 27.7623 0.3152 15.1307 0.9855 3.7538 12.6774 7.2960 17.2324 27.9285 35.0353 22.9146 4.3281 5.7173 0.1861 12.5842 5.4881 0.8221 1.6287 25.0010 156.9746 7.9592 54.7469 37.8194 90.2033 235.6953 45.0407 127.0084 18.3854 3.0923 22.7072 19.1733 4.6631 2.9029 0.8656 238.8758 2.9696 2.5681 5.3716 64.7885 28.1200 4.1342 19.9962 25.4847 12.5197 18.7632 13.9069 231.9520 160.0360 11.2552 13.2938 2.9126 35.9191 3.3460 95.0726 7.8565 27.1918 22.0907 112.5814 12.4505 5.3143 91.6826 158.5574 91.1966 6.1467 74.5260 77.8176 45.8982 136.2576 90.2323 97.1962 40.0058 26.6659 22.4337 29.8519 28.6903 47.0163 7.5266 34.6318 30.7746 76.5069 18.2543 27.8159 49.8606 19.9049 10.3173 22.2232 1.5827 21.1449 3.8426 17.6433 22.5898 28.4821 4.6320 9.1568 21.7907
temp: 298.150 k
press: 1.00000 atm
elementType: 8 8 8 7 7 7 6 6 6 6 6 6 6 6 6 6 6 6 6 6 6 6 6 6 6 6 6 6 6 1 1 1 1 1 1 1 1 1 1 1 1 1 1 1 1 1 1 1 1 1 1 1 1 1 1 1 1 1
symmnumber: 1
zpe: 1254423.9 jmol-1
zpe.correction: 0.477785 hartree
zpe.thermalcorrener: 0.507983 hartree
zpe.thermalcorrenthalpy: 0.508927 hartree
zpe.thermalcorrgfe: 0.411382 hartree
zpe.sumelectzpe: -1281.604027 hartree
zpe.sumelectthermal: -1281.573829 hartree
zpe.sumelectthermalent: -1281.572885 hartree
zpe.sumelectthermalfe: -1281.670430 hartree
dipole: -0.8498 -5.5118 -1.9335
dipole: 5.9026
quadrupole: -135.1757 -155.4389 -172.4093
quadrupole: -0.4212 7.9943 1.9566
quadrupole: 19.1656 -1.0976 -18.0680 -0.4212 7.9943 1.9566
hfenergy: -1282.081812 hartree
pointgroup: C01 [X(C23H29N3O3)]
dipole: -0.228406 1.7603766 1.4972811 debye
polarizability: 461.1087401|-53.080371|284.5613484|-49.4922533|26.9666648|222.8663137 unknown
InChI: InChI=1S/C23H29N3O3/c1-4-26(5-2)16-15-24-23(28)21(17-18-11-13-20(29-3)14-12-18)25-22(27)19-9-7-6-8-10-19/h6-14,17,24-25H,4-5,15-16H2,1-3H3
charge 0 multiplicity 1
58 atoms
O  0.33014 -0.59874 -1.331281
O  -5.257589 3.170605 1.496104
O  2.781938 -1.364033 0.721855
N  -3.109839 -3.392993 -0.731577
N  -0.447549 -1.134715 0.800554
N  2.36544 0.897158 0.336058
C  -2.446231 -2.116055 -0.381237
C  -4.072483 -3.851874 0.301916
C  -3.636522 -3.433134 -2.120004
C  -1.117666 -2.376567 0.373988
C  -4.279502 -5.379193 0.306126
C  -2.516059 -3.563587 -3.170099
C  0.265217 -0.361999 -0.082963
C  0.95912 0.848528 0.529016
C  0.318902 1.918977 1.108605
C  -1.120221 2.214314 1.198325
C  3.202734 -0.226342 0.351432
C  -2.101852 1.689879 0.30078
C  -1.567413 3.117677 2.20239
C  4.625374 0.018812 -0.066209
C  -3.457088 2.025989 0.431397
C  -2.927213 3.461811 2.349822
C  -3.881197 2.906228 1.460916
C  5.614929 -0.879344 0.40997
C  5.005643 1.079176 -0.931414
C  6.966923 -0.705069 0.05141
C  6.360056 1.249812 -1.293053
C  7.344313 0.363951 -0.796525
C  -5.74624 4.090949 2.525932
H  -3.102886 -1.457294 0.234928
H  -2.202768 -1.560986 -1.303766
H  -3.668906 -3.551611 1.288014
H  -5.06279 -3.337302 0.199846
H  -4.30513 -4.309421 -2.204586
H  -4.263787 -2.533278 -2.345998
H  -0.443985 -2.939366 -0.295788
H  -1.304337 -2.993736 1.270735
H  -4.714573 -5.73944 -0.64357
H  -3.312615 -5.891614 0.452043
H  -4.967206 -5.673935 1.121067
H  -1.802857 -2.720828 -3.117265
H  -1.94824 -4.495375 -3.002508
H  -2.941286 -3.583541 -4.191361
H  -0.373544 -0.913442 1.794207
H  0.971204 2.687335 1.55364
H  2.796331 1.816465 0.220995
H  -1.795009 1.042938 -0.525696
H  -0.833403 3.552616 2.892464
H  -4.20723 1.635516 -0.263128
H  -3.225087 4.154747 3.142373
H  5.296586 -1.70844 1.05046
H  4.248146 1.741162 -1.368587
H  7.725454 -1.400409 0.426976
H  6.644923 2.061344 -1.971512
H  8.39455 0.497606 -1.078701
H  -6.832207 4.152275 2.36374
H  -5.541966 3.702611 3.542798
H  -5.294744 5.095984 2.414442
