program: Gaussian 09
title: 000251039
version: EM64L-G09RevD.01
frameworkgroup: C1[X(C15H20O6)]
method: RPBEPBE
basis: SDD
operation: Freq
keyword: #pfreq=noraman
keyword: PBEPBE/SDD
title: #p freq=noraman PBEPBE/SDD
converged: NO YES NO NO
title: Mulliken charges:
elementType: O O O O O O C C C C C C C C C C C C C C C H H H H H H H H H H H H H H H H H H H H
charge: -0.264545 -0.283418 -0.265656 -0.230876 -0.212645 -0.238735 0.075882 -0.306253 -0.213501 -0.345165 -0.558198 -0.166496 -0.245948 0.213274 0.231739 0.242058 -0.261894 -0.255819 -0.505241 -0.662314 -0.668176 0.292047 0.265409 0.330856 0.245016 0.261255 0.260488 0.243480 0.233742 0.224734 0.243447 0.219327 0.240398 0.234368 0.238658 0.228709 0.254194 0.216987 0.219154 0.254230 0.215428
chargesum: 0.00000
title: Mulliken charges with hydrogens summed into heavy atoms:
elementType: O O O O O O C C C C C C C C C C C C C C C
charge: -0.264545 -0.283418 -0.265656 -0.230876 -0.212645 -0.238735 0.075882 -0.014206 0.051907 -0.014309 -0.051927 0.093992 -0.002468 0.213274 0.231739 0.242058 0.196583 0.206956 0.208182 0.037576 0.020637
polarizability: 1.91625729e+02 1.41088825e+00 1.67510096e+02 3.27128653e+00 -1.92237984e+00 1.59870344e+02
1716.lowfreq: -11.6672 -0.0007 0.0004 0.0007 4.1392 8.9311 25.9311 42.5849 53.5318
frequency: 25.8934 42.4879 53.5177 57.0855 60.8595 72.5004 84.8897 93.5006 106.4171 121.6341 131.4042 144.6556 148.4150 170.3856 203.4612 208.9278 217.0007 248.6545 259.2867 271.8078 308.1920 315.9709 338.8488 377.0797 391.5545 401.9473 437.4551 445.6718 497.5088 531.2256 640.0657 646.5708 669.8604 698.9696 707.7956 737.0935 742.2547 745.1659 777.7905 792.9294 810.5455 815.8557 819.3872 838.3869 855.9073 881.8202 907.1077 915.7982 926.8682 936.1780 969.4373 983.7409 987.3717 1001.8538 1012.5357 1029.2131 1034.2223 1065.3183 1094.1750 1095.9957 1097.5596 1113.5353 1118.6777 1123.0456 1148.2151 1149.2571 1157.3051 1159.1379 1163.1503 1179.7787 1198.8634 1242.8888 1249.3663 1267.0902 1274.9721 1279.1453 1283.3256 1326.3044 1350.3743 1354.6818 1355.1619 1389.1005 1393.3155 1422.3117 1452.1130 1456.8777 1458.4288 1462.0757 1464.3259 1464.6582 1480.6437 1483.8804 1485.4431 1583.7014 1619.6697 1640.9170 1650.1948 2991.0584 2994.6398 3002.6603 3024.2268 3030.2403 3032.7017 3055.7373 3083.9679 3089.3673 3094.5082 3095.9890 3096.0923 3100.0603 3103.2748 3115.6263 3119.6925 3121.6430 3148.0443 3177.8611 3219.0010
redmass: 4.5547 3.3734 3.3998 3.7071 3.7365 3.5496 4.1742 1.2496 4.1204 3.2914 3.6877 3.6440 4.6080 4.5174 4.8047 1.4723 1.2664 3.4816 4.4416 4.2323 3.3282 2.8604 5.4383 3.9273 6.3410 4.1055 3.5431 3.8893 2.0864 4.2998 5.9575 5.5996 5.2492 3.5060 4.6258 4.7615 2.4199 2.7858 4.7049 2.8474 1.7962 2.5389 1.4820 4.2573 3.5994 3.7587 2.6680 2.1534 1.4352 4.2452 2.5466 2.6173 2.7610 2.0819 2.4671 2.3597 4.5017 4.0623 1.6456 1.5481 2.0720 1.2704 1.1861 3.3150 2.3809 1.5832 1.6696 1.6682 2.0689 2.6324 2.5223 1.4163 1.5852 1.3446 1.1186 1.1192 1.5155 1.7148 1.3381 1.2816 1.4754 1.2342 1.2302 1.1938 1.0503 1.0827 1.0951 1.0537 1.0503 1.0421 1.1041 1.0522 1.0524 5.7465 9.9836 9.4116 10.4955 1.0360 1.0362 1.0296 1.0605 1.0599 1.0592 1.0838 1.0978 1.0972 1.1027 1.1025 1.0912 1.1047 1.1043 1.0914 1.1063 1.1057 1.1046 1.0906 1.1069
irintensity: 1.2615 0.0371 0.3054 1.1947 2.1554 0.4133 0.2397 0.3460 0.5319 1.4039 0.7054 4.5259 1.0334 0.0901 6.8001 1.2263 5.4756 2.8049 0.0450 3.9361 29.9781 16.3155 4.4095 0.7723 5.9704 4.0767 6.7930 0.2110 1.2394 16.2475 3.3388 14.1993 8.1612 18.7267 5.9546 7.5514 29.7510 9.3622 4.3959 6.9930 1.0862 11.1305 0.9683 12.3446 27.2893 8.7713 6.0870 7.6229 4.7352 12.7190 10.3436 0.3607 14.6836 5.2554 66.3125 39.6441 79.3481 153.5695 27.1750 37.2832 7.0964 1.2921 69.4214 55.0215 310.5020 35.4871 7.8484 8.1080 40.9249 246.1083 165.2176 2.7466 7.8447 1.7019 3.5204 4.3007 4.8450 28.1311 12.3451 3.4695 34.3953 19.9945 23.6006 23.9876 13.4854 23.0575 2.5817 25.2407 9.6350 3.1906 15.7478 11.6278 23.3876 2.3811 237.3901 112.5484 75.2954 21.7603 18.4957 37.4774 28.0374 35.2763 21.2354 5.4528 49.1977 30.1315 3.7439 2.7717 24.1848 24.6009 26.7680 10.7693 28.4695 27.7165 17.1899 5.0376 6.4131
temp: 298.150 k
press: 1.00000 atm
elementType: 8 8 8 8 8 8 6 6 6 6 6 6 6 6 6 6 6 6 6 6 6 1 1 1 1 1 1 1 1 1 1 1 1 1 1 1 1 1 1 1 1
symmnumber: 1
zpe: 861935.4 jmol-1
zpe.correction: 0.328294 hartree
zpe.thermalcorrener: 0.350246 hartree
zpe.thermalcorrenthalpy: 0.351190 hartree
zpe.thermalcorrgfe: 0.276249 hartree
zpe.sumelectzpe: -1033.303465 hartree
zpe.sumelectthermal: -1033.281512 hartree
zpe.sumelectthermalent: -1033.280568 hartree
zpe.sumelectthermalfe: -1033.355509 hartree
dipole: 0.9843 0.5666 -1.4470
dipole: 1.8394
quadrupole: -101.4265 -111.3807 -132.8780
quadrupole: -2.3183 2.9791 -5.1420
quadrupole: 13.8019 3.8477 -17.6496 -2.3183 2.9791 -5.1420
hfenergy: -1033.6317584 hartree
pointgroup: C01 [X(C15H20O6)]
dipole: -0.5000863 -0.5171904 -0.0784049 debye
polarizability: 171.6729065|1.3187518|168.4139056|-15.3632013|-4.9423308|178.9193573 unknown
InChI: InChI=1S/C15H20O6/c1-4-20-13(17)15(14(18)21-5-2)10-7-6-9(8-10)11(15)12(16)19-3/h6-7,9-11H,4-5,8H2,1-3H3
charge 0 multiplicity 1
41 atoms
O  -1.978771 0.357897 1.369591
O  0.36171 -1.624794 0.765075
O  1.389418 -1.054257 -3.158437
O  -2.360936 -0.013193 -0.896401
O  1.420393 0.134423 1.871502
O  2.478532 -0.848234 -1.112438
C  -0.071318 0.576172 -0.075719
C  0.140325 2.144627 0.187532
C  0.800556 1.912231 -1.978566
C  0.386103 0.416175 -1.577124
C  -0.297805 2.70092 -1.202263
C  1.646906 2.412372 0.136661
C  2.041306 2.283422 -1.162747
C  -1.576648 0.250253 0.04285
C  0.676958 -0.282141 0.961141
C  1.515665 -0.552116 -1.8562
C  -3.415203 0.053528 1.666159
C  1.076434 -2.606708 1.637025
C  2.477265 -1.958911 -3.599915
C  -3.625251 -1.453324 1.832757
C  0.33893 -2.800838 2.964634
H  -0.389662 2.491517 1.084319
H  0.855659 2.049239 -3.068032
H  -0.484499 0.116065 -2.183703
H  -1.327021 2.433001 -1.500036
H  -0.154865 3.791051 -1.276026
H  2.273338 2.558219 1.01649
H  3.061704 2.312913 -1.550722
H  -4.034344 0.459303 0.84683
H  -3.60493 0.606789 2.599533
H  2.105659 -2.239956 1.792288
H  1.090207 -3.526339 1.030402
H  2.515097 -2.852079 -2.953769
H  2.216193 -2.227529 -4.633009
H  3.450416 -1.441204 -3.554817
H  -2.961698 -1.85748 2.616383
H  -3.426735 -1.983743 0.886772
H  -4.672587 -1.650388 2.128178
H  -0.702644 -3.124414 2.793229
H  0.333624 -1.865426 3.548178
H  0.849018 -3.580044 3.561394
