program: Gaussian 09
title: 000250960
version: EM64L-G09RevD.01
frameworkgroup: C1[X(C10H10O4S)]
method: RPBEPBE
basis: SDD
operation: Freq
keyword: #p
keyword: freq=noraman
keyword: PBEPBE/SDD
title: #p freq=noraman PBEPBE/SDD
converged: YES YES NO NO
title: Mulliken charges:
elementType: S O O O O C C C C C C C C C C H H H H H H H H H H
charge: 0.222838 -0.422428 -0.407967 -0.225331 -0.234719 -0.536055 -0.464088 -0.160211 0.273870 0.201100 -0.278254 -0.211411 -0.207278 -0.227379 -0.233306 0.332264 0.287433 0.279075 0.250796 0.297586 0.231731 0.231234 0.232296 0.386491 0.381713
chargesum: 0.00000
title: Mulliken charges with hydrogens summed into heavy atoms:
elementType: S O O O O C C C C C C C C C C
charge: 0.222838 -0.035936 -0.026254 -0.225331 -0.234719 -0.203791 0.102419 -0.160211 0.273870 0.201100 -0.027458 0.086175 0.024453 0.003855 -0.001010
polarizability: 1.87704466e+02 -1.15514508e+01 1.14779155e+02 1.82709038e+01 2.11194411e+01 1.07460538e+02
1716.lowfreq: -6.0401 -0.0032 -0.0026 -0.0022 4.3597 12.5065 26.0172 39.7001 45.0351
frequency: 25.9216 39.6881 45.0256 68.3827 78.0899 84.3931 132.5417 166.8918 195.3402 231.4281 254.9013 296.9797 353.3271 398.2878 408.3417 474.5621 487.7076 508.7449 550.5670 572.6678 603.7247 610.3889 641.5657 654.7296 674.0249 696.8782 750.3490 763.3323 800.0499 851.9448 874.1671 924.7026 979.3533 983.4909 986.1192 997.8024 1016.8712 1038.6391 1056.6964 1071.7057 1079.4440 1113.3604 1167.4813 1173.0708 1192.0292 1197.5241 1246.9859 1270.3938 1313.0152 1345.3600 1370.9029 1374.4054 1425.5320 1428.3124 1463.4560 1585.9787 1589.0518 1659.3477 1662.6674 3025.2004 3080.5544 3096.4014 3128.9775 3137.3529 3149.2529 3157.3022 3168.9967 3514.8433 3523.2364
redmass: 6.3830 7.1428 5.9423 5.7608 7.8433 7.7520 5.3061 7.1122 4.5364 8.3122 3.8104 6.3939 7.5142 5.1127 4.0686 3.3880 2.0557 3.1552 2.2330 3.7449 2.5140 6.3819 1.5207 2.7885 6.8322 2.4337 1.4972 5.7912 3.5011 1.2477 3.9297 1.3538 1.5320 4.0382 2.5329 1.3166 3.5566 3.3528 2.4238 2.3411 1.6377 1.8884 1.1695 1.0534 1.1498 1.2867 1.4220 1.6268 1.3264 2.0130 2.0507 7.0989 1.0981 2.1085 2.0083 6.2177 5.8288 8.3797 8.6833 1.0609 1.0970 1.0890 1.0848 1.0884 1.0929 1.0967 1.1018 1.0641 1.0640
irintensity: 0.3696 1.0490 1.2711 1.0653 2.0718 0.6720 1.1712 1.0715 0.4727 3.1941 3.2527 0.5800 0.7361 0.5293 0.9985 5.2000 23.0514 74.3517 45.5771 72.1836 45.3058 1.3041 107.4550 88.6195 12.3101 32.2660 76.9313 12.8610 5.5308 0.1917 1.5882 3.6767 0.5360 11.2000 7.9706 0.7990 21.2126 52.9545 445.6261 11.8289 8.9776 9.1249 10.7450 0.1418 1.4571 6.5857 0.8028 4.7014 4.4012 93.6538 42.3993 1.9372 37.0943 15.6068 48.0000 1.7533 30.0528 296.8918 156.0510 6.4276 0.2035 0.1781 0.2917 10.5323 11.4211 9.7582 29.7964 29.6999 34.8845
temp: 298.150 k
press: 1.00000 atm
elementType: 16 8 8 8 8 6 6 6 6 6 6 6 6 6 6 1 1 1 1 1 1 1 1 1 1
symmnumber: 1
zpe: 478451.0 jmol-1
zpe.correction: 0.182232 hartree
zpe.thermalcorrener: 0.197047 hartree
zpe.thermalcorrenthalpy: 0.197991 hartree
zpe.thermalcorrgfe: 0.137794 hartree
zpe.sumelectzpe: -1084.929581 hartree
zpe.sumelectthermal: -1084.914766 hartree
zpe.sumelectthermalent: -1084.913822 hartree
zpe.sumelectthermalfe: -1084.974019 hartree
dipole: 1.4876 -0.9739 1.3304
dipole: 2.2207
quadrupole: -85.3120 -84.9074 -99.0376
quadrupole: 3.2041 -0.8050 2.5151
quadrupole: 4.4404 4.8449 -9.2853 3.2041 -0.8050 2.5151
hfenergy: -1085.1118133 hartree
pointgroup: C01 [X(C10H10O4S1)]
dipole: -0.4985404 -0.7143341 0.0671118 debye
dipolederiv: -0.3358785 -0.1162991 -0.0074313 -0.2461984 -0.1464564 0.1004701 0.0877983 0.1669815 -0.0354038 -0.6927025 0.018356 -0.3667794 0.0545272 -0.3121623 0.0116575 -0.3327585 0.0103532 -0.8872779 -1.2169542 0.1516651 -0.4283836 0.2512824 -0.4366662 0.1729896 -0.395057 0.150411 -0.4711624 -0.8103515 -0.2122689 -0.1066279 -0.478711 -0.6598281 0.1076342 0.0260169 0.1698534 -0.4931151 -0.7034977 0.1567595 0.0139045 0.1464789 -0.4065608 -0.1940312 -0.2266565 -0.0610009 -0.8617429 0.1789773 -0.1913356 -0.0016653 -0.1394221 0.033119 0.0707531 -0.1482839 0.0147102 -0.0836794 -0.1261853 0.0656064 0.0560126 0.1670529 0.0069854 -0.0545791 0.3845057 -0.136824 -0.1663832 0.6303312 0.3731569 0.0302203 0.4902963 0.1137122 -0.0217325 0.1733666 0.0056303 -0.0526029 1.107186 0.3886794 0.3919079 0.6459719 0.7571106 -0.3668227 0.1650101 -0.3535061 1.1068353 1.491884 -0.4148882 0.2942246 -0.5082787 0.4432188 0.1770094 0.3634024 0.1075416 1.1723939 -0.3401686 -0.0879336 0.0744412 -0.0641458 -0.1566182 0.0477477 -0.0352095 -0.000569 0.0549753 -0.248439 -0.0368528 -0.0549515 -0.1533334 -0.1761577 -0.0484405 -0.1036572 -0.0563125 -0.0710707 0.0206841 0.1029385 -0.0763425 0.0988437 -0.0729079 -0.0458328 -0.0175224 -0.0148428 0.0642453 -0.0186872 0.0762608 0.0480129 0.0780955 -0.0967709 0.0348842 0.0276907 0.0198292 0.1273229 -0.0276459 0.103501 0.0364075 0.0834765 -0.1009479 0.0263276 0.0074308 0.0091656 -0.0790432 0.0586409 -0.0107691 -0.0139932 -0.0183102 0.0117903 -0.0087556 -0.0170159 -0.033393 0.0276293 0.0626787 -0.0044464 -0.0049015 -0.0506478 0.0427553 -0.0682773 -0.0161748 -0.0251931 0.1211409 0.0971743 0.0143178 0.0399472 0.0056426 0.0371751 0.0676949 0.0008002 0.0802302 0.0398547 0.108421 -0.03709 -0.0737956 -0.0201208 0.1349406 -0.0366034 -0.0535346 -0.0188807 -0.0341145 0.1445064 -0.0181805 0.0297427 -0.0194366 0.1303034 0.0177017 0.0345795 0.015271 0.0566503 0.0177236 -0.0787074 0.0878025 -0.0909598 0.1087694 0.0524049 0.0937212 0.0555014 -0.0309523 0.0632784 -0.0522499 -0.0438539 -0.0494018 0.1279343 -0.0313119 -0.0731032 -0.038892 -0.0899339 -0.0489313 -0.1278502 -0.0283285 -0.134503 0.0819089 -0.022427 -0.0348443 -0.0221101 0.0840099 0.2796711 -0.1176253 0.0485343 -0.1133764 0.2067714 0.1045132 -0.0155861 0.0643784 0.3219036 0.308285 0.0552558 0.0558961 0.0651778 0.3285817 -0.0929741 0.1050817 -0.108333 0.179521 unknown
polarizability: 180.5246786|32.6774411|96.4050907|-5.612358|-1.8731326|133.0143888 unknown
InChI: InChI=1S/C10H10O4S/c11-9(12)6-8(10(13)14)15-7-4-2-1-3-5-7/h1-5,8,11,13H,6H2
charge 0 multiplicity 1
25 atoms
S  -0.259455 1.189439 1.138718
O  0.408194 1.47536 -2.162605
O  4.506207 -0.861445 0.618252
O  2.27274 2.368293 -1.103244
O  3.216952 -0.915711 -1.313764
C  1.065174 0.482192 -0.062447
C  2.327024 0.141848 0.740791
C  -1.742275 0.173483 0.707591
C  1.346421 1.530444 -1.126942
C  3.351083 -0.58149 -0.116127
C  -2.524598 -0.31414 1.781697
C  -2.127787 -0.064628 -0.632866
C  -3.705407 -1.042466 1.509076
C  -3.296886 -0.816264 -0.8919
C  -4.090919 -1.301707 0.173443
H  0.619569 -0.41051 -0.52676
H  2.795537 1.057354 1.144752
H  2.070938 -0.498467 1.603581
H  -2.2099 -0.135466 2.815406
H  -1.53391 0.341221 -1.458395
H  -4.311768 -1.417499 2.340913
H  -3.592507 -1.007473 -1.929464
H  -5.000535 -1.875482 -0.034673
H  0.606881 2.19074 -2.825204
H  5.163424 -1.332428 0.036971
