program: Gaussian 09
title: 000250953
version: EM64L-G09RevD.01
frameworkgroup: C1[X(C12H17NO2S2)]
method: RPBEPBE
basis: SDD
operation: Freq
keyword: #p
keyword: freq=noraman
keyword: PBEPBE/SDD
title: #p freq=noraman PBEPBE/SDD
converged: YES YES NO NO
title: Mulliken charges:
elementType: S S O O N C C C C C C C C C C C C H H H H H H H H H H H H H H H H H
charge: 0.519628 0.893843 -0.577868 -0.544027 -0.579693 -0.364920 -0.387361 -0.381882 -0.596242 -0.610306 -0.038113 -0.251570 -0.234265 0.452443 -0.366470 -0.369468 -0.802847 0.225206 0.201765 0.231550 0.224176 0.222306 0.232751 0.292374 0.291230 0.318653 0.273200 0.286388 0.269949 0.238644 0.236496 0.225879 0.227531 0.241020
chargesum: 0.00000
title: Mulliken charges with hydrogens summed into heavy atoms:
elementType: S S O O N C C C C C C C C C C C C
charge: 0.519628 0.893843 -0.577868 -0.544027 -0.579693 0.062050 0.068365 0.073175 -0.012638 -0.018452 -0.038113 0.034818 0.035684 0.452443 -0.127826 -0.132973 -0.108418
polarizability: 2.78707998e+02 -3.18967920e-01 1.62603620e+02 -1.21140583e+01 -1.52784201e+01 1.52327290e+02
1716.lowfreq: -5.0109 0.0013 0.0014 0.0023 5.9485 11.4202 26.9422 29.9050 32.0925
frequency: 26.1175 29.7943 32.0899 35.3564 54.4642 82.1584 117.5565 134.1257 143.3544 153.7295 203.8394 213.1873 221.1937 272.0226 288.7638 314.4253 332.9130 350.0533 366.2926 379.2214 391.2582 408.0171 464.0086 486.3868 499.1736 548.5367 566.9468 592.9331 614.4892 623.6628 626.9646 711.8665 774.5340 791.1995 796.8767 803.4691 827.0548 834.9199 851.2933 891.9127 904.0375 941.7168 951.9640 959.4962 980.6712 989.8637 998.0000 1029.9164 1048.5738 1059.4831 1069.5497 1084.8687 1114.7673 1115.2820 1150.1146 1181.1547 1198.2683 1218.1673 1233.5120 1253.0776 1264.0378 1293.6298 1300.3395 1343.5933 1349.7864 1350.6910 1381.7749 1391.4187 1397.0735 1436.6485 1443.0442 1451.7417 1461.8519 1470.1233 1471.7741 1474.2416 1474.8710 1596.6894 1598.8823 2978.4642 2980.5729 2982.6805 2983.8457 3028.7362 3032.4230 3040.3609 3044.0457 3054.6459 3060.5690 3089.0294 3124.1959 3125.4243 3130.1110 3132.2658 3159.6463 3163.1133
redmass: 3.6044 3.6741 1.0982 3.7222 7.0779 3.9964 4.5889 6.6480 5.4434 6.8266 3.2741 2.1117 7.0821 4.9872 5.3601 4.9955 2.2501 3.1090 4.8949 4.3990 5.6395 2.8699 4.6289 2.2185 2.9695 4.9440 5.9472 6.1138 4.5130 7.1782 11.3665 3.2856 6.3595 7.6704 1.5878 2.6846 1.3924 1.3951 1.2508 1.5419 14.7706 2.0190 2.1855 1.3214 1.3823 1.3945 5.1109 1.8989 1.5887 2.5059 1.1745 1.5666 1.6129 1.3106 1.2387 1.1504 1.3080 2.9389 1.3035 1.2287 1.2448 1.2667 1.1996 1.3603 1.4722 1.4419 6.0487 3.0657 1.2221 1.0945 1.0850 1.0817 1.0810 1.0892 1.0938 1.1195 2.1629 6.9777 6.1568 1.0386 1.0604 1.0630 1.0629 1.0769 1.0801 1.0826 1.0780 1.1000 1.0950 1.0999 1.1075 1.1081 1.0892 1.0893 1.0951 1.0962
irintensity: 2.0226 0.9764 0.3793 1.1674 0.8057 1.0935 1.5303 2.3033 0.9060 10.5438 1.0446 0.7675 11.2653 1.8864 14.3360 4.4836 2.1422 4.7304 4.4930 3.0148 5.6647 0.0765 69.9460 8.5112 18.9860 8.7227 54.7602 23.4907 4.3794 13.3125 150.8649 0.6525 38.1769 76.0053 0.3619 7.6352 28.1702 8.9000 2.3821 20.7744 96.9691 0.8634 22.9412 0.7680 0.4726 1.4533 3.4537 5.1685 23.2417 27.3493 0.4986 2.7856 0.2315 8.4792 2.9702 13.4681 6.4975 5.6311 1.2725 2.9992 2.2034 2.3484 1.5636 3.6166 2.3894 0.0835 0.1021 8.5989 13.1902 3.6452 28.1533 8.8299 23.7779 11.4923 15.7410 14.2995 21.7554 0.3016 8.8946 33.5746 24.7660 27.9047 27.2851 2.9358 10.4359 20.4208 15.7802 57.2066 20.8315 16.6235 1.0463 5.3052 16.7097 13.1552 4.3060 9.4690
temp: 298.150 k
press: 1.00000 atm
elementType: 16 16 8 8 7 6 6 6 6 6 6 6 6 6 6 6 6 1 1 1 1 1 1 1 1 1 1 1 1 1 1 1 1 1
symmnumber: 1
zpe: 702213.9 jmol-1
zpe.correction: 0.267459 hartree
zpe.thermalcorrener: 0.286122 hartree
zpe.thermalcorrenthalpy: 0.287067 hartree
zpe.thermalcorrgfe: 0.218090 hartree
zpe.sumelectzpe: -1467.259886 hartree
zpe.sumelectthermal: -1467.241223 hartree
zpe.sumelectthermalent: -1467.240278 hartree
zpe.sumelectthermalfe: -1467.309255 hartree
dipole: -4.2427 -6.6267 -2.2560
dipole: 8.1856
quadrupole: -71.6501 -126.4232 -118.2761
quadrupole: -1.1593 -0.0082 -6.8272
quadrupole: 33.7997 -20.9734 -12.8263 -1.1593 -0.0082 -6.8272
hfenergy: -1467.527345 hartree
pointgroup: C01 [X(C12H17N1O2S2)]
dipole: -1.6645561 2.6768878 -0.6594319 debye
polarizability: 278.6572796|6.6907897|145.7605952|10.3720493|-11.0854046|169.221034 unknown
InChI: InChI=1S/C12H17NO2S2/c1-11-5-7-12(8-6-11)17(14,15)13-16-9-3-2-4-10-16/h5-8H,2-4,9-10H2,1H3
charge 0 multiplicity 1
34 atoms
S  -2.560899 -0.541725 0.599068
S  0.243542 -1.411659 0.480324
O  -0.23565 -2.104416 -0.939925
O  0.477913 -2.392642 1.768003
N  -0.837144 0.070838 0.799772
C  -4.996551 1.315904 -0.617433
C  -4.818575 1.152587 0.913019
C  -4.474716 0.101389 -1.424353
C  -3.353328 1.013186 1.356116
C  -2.969924 -0.13721 -1.243113
C  1.8515 -0.469122 0.203104
C  2.77032 -0.408218 1.261745
C  2.093693 0.099553 -1.056958
C  4.281662 0.866596 -0.213445
C  3.989884 0.269738 1.041348
C  3.320718 0.770076 -1.255361
C  5.610678 1.562362 -0.448799
H  -6.069204 1.468304 -0.839198
H  -4.466486 2.230991 -0.951267
H  -5.233358 2.039433 1.431141
H  -5.40434 0.281775 1.268237
H  -5.040065 -0.809918 -1.144508
H  -4.662941 0.262244 -2.504066
H  -2.708345 1.840837 1.014963
H  -3.23557 0.879458 2.442266
H  -2.568846 -1.008455 -1.784016
H  -2.350585 0.751228 -1.455598
H  2.536693 -0.892882 2.215364
H  1.354207 0.000794 -1.85786
H  4.723637 0.334563 1.85335
H  3.535566 1.222777 -2.230608
H  5.521965 2.363555 -1.203173
H  6.005645 2.007885 0.480897
H  6.369906 0.84567 -0.817831
