program: Gaussian 09
title: 000250963
version: EM64L-G09RevD.01
frameworkgroup: C1[X(C13H15NO6)]
method: RPBEPBE
basis: SDD
operation: Freq
keyword: #p
keyword: freq=noraman
keyword: PBEPBE/SDD
title: #p freq=noraman PBEPBE/SDD
converged: YES YES NO NO
title: Mulliken charges:
elementType: O O O O O O N C C C C C C C C C C C C C H H H H H H H H H H H H H H H
charge: -0.283453 -0.225866 -0.185117 -0.231713 -0.270229 -0.245846 0.122442 0.241120 -0.274755 -0.686730 -0.703506 0.174808 0.194120 0.181832 -0.372203 -0.334713 -0.221004 -0.217440 0.159963 -0.516293 0.240591 0.273470 0.221199 0.236497 0.251839 0.263542 0.205933 0.237525 0.266789 0.268317 0.239832 0.238626 0.281221 0.237943 0.231261
chargesum: 0.00000
title: Mulliken charges with hydrogens summed into heavy atoms:
elementType: O O O O O O N C C C C C C C C C C C C C
charge: -0.283453 -0.225866 -0.185117 -0.231713 -0.270229 -0.245846 0.122442 0.241120 0.239305 0.022805 0.003494 0.174808 0.194120 0.181832 -0.105414 -0.066396 0.018828 0.021186 0.159963 0.234131
polarizability: 1.95090591e+02 -7.37381619e+00 1.80046816e+02 2.64443661e+01 4.91992079e+00 1.28099763e+02
1716.lowfreq: -8.6562 -5.9825 -3.5788 -0.0007 -0.0005 0.0003 19.4480 30.1654 40.5098
frequency: 19.0593 30.1141 40.4956 45.1926 67.8887 79.5106 96.7042 108.4027 139.1210 146.3926 158.3042 187.6320 194.5151 220.4992 230.6354 248.1428 255.9831 282.4854 287.9005 299.8687 342.6067 352.9586 356.4629 387.2782 411.4683 446.9215 502.0759 518.1537 528.6339 555.9330 640.7840 665.8871 671.2226 680.8569 703.0692 758.4808 769.2187 780.0260 786.4934 798.2698 833.4281 898.9212 908.7105 915.0876 943.7806 949.1496 974.0287 996.8488 1003.5179 1017.3402 1032.0954 1042.3912 1077.2086 1119.1380 1124.2551 1151.3804 1155.7476 1177.4639 1188.2709 1219.2903 1227.7881 1232.9852 1254.8847 1279.2272 1283.6501 1347.8276 1380.8879 1381.3393 1400.5097 1409.4680 1425.1638 1433.1399 1451.0668 1456.7635 1461.8868 1467.2930 1471.4162 1475.1364 1475.7224 1488.6277 1579.8565 1602.3410 1620.8884 1634.3192 2999.1086 3002.2670 3006.8855 3017.8895 3089.6698 3097.9862 3104.8031 3108.4701 3110.9360 3127.2867 3139.0401 3151.6620 3152.6654 3166.6725 3178.0356
redmass: 5.9792 7.9245 5.9990 7.2413 8.3058 6.2501 4.2807 4.5846 1.1286 4.0775 3.4319 1.0618 3.4636 4.9745 1.2385 4.0898 3.9727 3.4428 4.5572 3.9530 5.3811 5.8940 2.8129 4.4262 3.6969 4.4007 4.4880 3.5803 4.7916 4.8062 6.4619 6.3831 7.3068 5.8429 4.2976 9.6949 6.2633 4.1280 1.5638 5.5062 3.0289 1.5513 4.9839 3.0318 1.4522 2.3503 1.4090 1.6702 1.3568 1.5988 2.8227 5.1210 3.1794 1.7962 1.3051 1.8349 1.4683 1.0617 2.3294 4.1432 3.2883 1.9819 3.5358 1.5580 2.6890 1.4438 1.4768 6.4746 1.8386 2.0364 1.2792 1.9556 1.0673 1.0567 1.0726 1.0892 1.0542 1.3098 1.7449 1.0546 7.1488 6.5918 9.4794 12.0403 1.0354 1.0295 1.0378 1.0560 1.1077 1.0999 1.0985 1.1054 1.1011 1.1006 1.0862 1.1047 1.0910 1.0959 1.0991
irintensity: 2.8505 0.6803 1.7157 2.0762 1.6352 1.5355 7.6555 0.7358 0.9214 2.1953 1.2890 0.2713 2.8166 1.8737 2.2006 1.6068 2.6404 4.4221 11.1160 9.0683 2.5743 6.0589 8.4339 0.8457 2.3374 4.7056 5.0730 5.4177 2.9938 2.3650 3.7805 6.1228 1.9792 8.7813 62.4242 20.8436 7.4436 11.9958 42.5375 1.3997 7.0892 1.1561 5.8650 10.5282 5.6554 4.2882 2.0540 11.3577 1.5427 46.8913 84.3933 55.9990 301.0621 11.2483 6.1410 14.6867 32.6672 0.4829 12.7527 35.3802 106.4048 43.5140 299.0329 19.0115 16.9190 21.7709 67.5586 19.1132 81.2199 29.4804 27.9330 2.4561 2.0335 11.4380 20.3038 0.9253 9.3999 17.0072 9.5320 26.9473 12.5380 50.8590 110.7463 206.0989 10.7397 35.0270 10.9544 19.5268 5.1144 3.7860 21.1706 9.2430 10.8632 15.0131 1.5958 14.1007 7.9751 10.8279 13.8291
temp: 298.150 k
press: 1.00000 atm
elementType: 8 8 8 8 8 8 7 6 6 6 6 6 6 6 6 6 6 6 6 6 1 1 1 1 1 1 1 1 1 1 1 1 1 1 1
symmnumber: 1
zpe: 695145.6 jmol-1
zpe.correction: 0.264767 hartree
zpe.thermalcorrener: 0.285222 hartree
zpe.thermalcorrenthalpy: 0.286166 hartree
zpe.thermalcorrgfe: 0.213849 hartree
zpe.sumelectzpe: -1008.911718 hartree
zpe.sumelectthermal: -1008.891263 hartree
zpe.sumelectthermalent: -1008.890319 hartree
zpe.sumelectthermalfe: -1008.962636 hartree
dipole: 0.0622 -1.1781 1.6706
dipole: 2.0451
quadrupole: -90.9859 -109.3676 -126.8321
quadrupole: 9.3835 9.0678 -6.8852
quadrupole: 18.0760 -0.3057 -17.7702 9.3835 9.0678 -6.8852
hfenergy: -1009.1764852 hartree
pointgroup: C01 [X(C13H15N1O6)]
dipole: -0.1076927 -0.5611482 0.5665014 debye
polarizability: 188.292648|-14.6390398|182.5514066|28.2259653|7.5307023|132.393115 unknown
InChI: InChI=1S/C13H15NO6/c1-13(2,14(17)18)8-20-12(16)10-7-5-4-6-9(10)11(15)19-3/h4-7H,8H2,1-3H3
charge 0 multiplicity 1
35 atoms
O  -0.710578 -0.763037 -0.301634
O  -2.404547 2.101251 -0.094219
O  -2.52963 1.190673 1.983613
O  -0.000454 -2.32915 -1.884049
O  1.508158 2.182805 0.613232
O  0.791364 1.321399 -1.429157
N  -2.627001 1.118157 0.709068
C  -3.069432 -0.246885 0.050735
C  -1.999913 -0.589608 -1.001284
C  -4.415553 0.037739 -0.655481
C  -3.185795 -1.314438 1.145868
C  0.259652 -1.542828 -0.94643
C  1.594646 -1.361254 -0.295751
C  2.080269 -0.082874 0.105873
C  2.366999 -2.51906 -0.043509
C  3.306923 0.00354 0.807095
C  3.597984 -2.420943 0.639908
C  4.060064 -1.159255 1.079268
C  1.383194 1.170821 -0.333081
C  0.814106 3.455579 0.278297
H  -2.270921 -1.521796 -1.528828
H  -1.870955 0.233955 -1.725095
H  -4.758108 -0.876958 -1.170079
H  -5.186169 0.324889 0.080276
H  -4.312308 0.847592 -1.396599
H  -2.220952 -1.47181 1.651786
H  -3.500849 -2.264488 0.678178
H  -3.933822 -1.027907 1.901998
H  1.986788 -3.489804 -0.377471
H  3.667249 0.987734 1.119391
H  4.187647 -3.322677 0.834951
H  5.009288 -1.078711 1.619298
H  -0.267496 3.268924 0.169278
H  1.216143 3.871479 -0.660753
H  1.022211 4.115743 1.131505
