program: Gaussian 09
title: 000250946
version: EM64L-G09RevD.01
frameworkgroup: C1[X(C11H5BrCl2N4)]
method: RPBEPBE
basis: SDD
operation: Freq
keyword: #p
keyword: freq=noraman
keyword: PBEPBE/SDD
title: #p freq=noraman PBEPBE/SDD
converged: YES YES NO NO
title: Mulliken charges:
elementType: Br Cl Cl N N N N C C C C C C C C C C C H H H H H
charge: 0.028922 0.061115 0.047684 -0.443366 -0.004116 0.141997 -0.005186 0.469110 0.215907 -0.448056 -0.306627 0.226219 -0.147967 -0.166337 -0.241191 -0.276631 -0.348073 -0.225767 0.348369 0.238810 0.323767 0.256656 0.254762
chargesum: 0.00000
title: Mulliken charges with hydrogens summed into heavy atoms:
elementType: Br Cl Cl N N N N C C C C C C C C C C C
charge: 0.028922 0.061115 0.047684 -0.094997 -0.004116 0.141997 -0.005186 0.469110 0.215907 -0.209246 0.017139 0.226219 0.108690 0.088424 -0.241191 -0.276631 -0.348073 -0.225767
polarizability: 3.41423276e+02 -9.06891373e+00 2.19980269e+02 4.75889538e-02 1.05789694e-02 6.28075898e+01
1716.lowfreq: -0.0025 -0.0019 0.0004 1.9302 2.6917 6.2045 28.8900 42.2611 55.1186
frequency: 28.8835 42.2128 55.1185 55.7949 108.9954 111.7439 160.5975 161.2841 165.8350 205.6991 216.2093 234.0657 288.0477 328.5240 343.9651 352.8144 396.3675 410.9105 412.6998 501.7223 516.5544 561.8543 593.4459 594.6017 623.5195 631.7364 655.0311 695.8094 713.3472 731.5384 773.5241 787.8101 823.4760 836.4863 851.2276 950.9076 960.2393 991.7751 993.2184 1063.9404 1082.6053 1121.6096 1193.3688 1202.7578 1238.6905 1266.4011 1298.9963 1336.5343 1353.5188 1396.3454 1422.7619 1436.5648 1479.5042 1545.2977 1557.2617 1599.6325 1607.7156 2160.8676 3124.5827 3169.1877 3176.1942 3201.9392 3480.3452
redmass: 14.8730 4.0735 18.4289 13.1689 10.2708 14.9561 24.4656 11.0766 11.4714 8.3772 17.8327 11.7651 5.8003 5.2854 10.0315 20.6925 11.1787 2.9907 12.1427 4.8540 4.1702 9.7820 10.2136 8.2005 8.5656 8.3733 5.9808 1.5890 2.8820 8.9843 9.6501 10.2332 1.3831 7.3505 1.3973 1.3641 8.7681 4.8178 1.3216 2.6276 7.4850 1.3787 1.1131 9.8934 3.0554 8.2110 1.3447 10.6266 4.7355 5.5163 4.1836 3.6251 2.5032 8.4633 4.1106 6.0728 2.7701 12.5983 1.0906 1.0914 1.0951 1.0953 1.0759
irintensity: 0.2650 0.0257 0.1900 1.6027 0.5740 3.5657 0.1920 0.4120 0.4275 2.5023 0.7122 4.2710 7.9690 0.1726 12.0299 3.6893 9.8309 0.0030 4.3401 18.5010 20.8779 11.8837 6.7500 0.4708 3.5649 2.6903 6.6012 35.6187 2.6391 34.1319 8.0694 74.5265 46.4671 36.7797 58.2867 1.9626 67.8389 69.7729 2.4335 27.4249 79.0822 14.0766 0.9207 177.4550 7.8218 65.7069 17.3155 113.4137 161.9837 103.0412 367.0055 39.1612 124.8155 715.2763 482.2668 0.7799 248.7086 42.0782 9.4210 2.1333 2.0702 12.9382 35.1198
temp: 298.150 k
press: 1.00000 atm
elementType: 35 17 17 7 7 7 7 6 6 6 6 6 6 6 6 6 6 6 1 1 1 1 1
symmnumber: 1
zpe: 367159.2 jmol-1
zpe.correction: 0.139844 hartree
zpe.thermalcorrener: 0.155838 hartree
zpe.thermalcorrenthalpy: 0.156782 hartree
zpe.thermalcorrgfe: 0.093203 hartree
zpe.sumelectzpe: -1573.502909 hartree
zpe.sumelectthermal: -1573.486914 hartree
zpe.sumelectthermalent: -1573.485970 hartree
zpe.sumelectthermalfe: -1573.549550 hartree
dipole: -2.0719 -0.8308 -0.0099
dipole: 2.2323
quadrupole: -144.3745 -132.6858 -127.9746
quadrupole: 4.1076 -0.0217 0.0056
quadrupole: -9.3629 2.3258 7.0371 4.1076 -0.0217 0.0056
hfenergy: -1573.6427527 hartree
pointgroup: C01 [X(C11H5Br1Cl2N4)]
dipole: -0.8231877 -0.2872408 -0.1058249 debye
dipolederiv: -0.8891153 0.1162822 0.030787 0.1706787 -0.0711213 -0.0147051 0.0499859 -0.0152747 -0.0264143 -0.8543597 0.2504681 0.0697847 0.3373882 -0.1684242 -0.0430544 0.0970916 -0.0438829 -0.0341532 -0.1007061 0.0555636 0.0172388 -0.1548074 -0.8697341 -0.2719866 -0.0513299 -0.2708043 -0.1252502 -2.0022395 -0.0814513 -0.0456804 -0.6903274 -0.2552176 0.0036136 -0.2471997 0.0097697 -0.2915446 -1.1663825 -0.3400239 -0.1230303 -1.0571674 -0.9287174 -0.262184 -0.3569618 -0.254375 -0.2454147 -1.0635266 0.5736222 0.1740646 0.3143455 -1.3855427 -0.4062084 0.0879822 -0.4031851 -0.2465015 -0.1953637 -0.0537693 -0.0172365 0.1289469 -0.416333 -0.0613025 0.0422078 -0.0631227 -0.243874 1.2366306 -0.0742382 -0.0120384 -0.3215857 0.0528072 -0.0164707 -0.0904221 -0.0135647 0.0867571 2.2657671 0.1226527 0.0648951 1.1303798 0.6243344 0.1471437 0.3951785 0.136269 0.2583578 -0.1613617 -0.0052012 -0.0022336 0.0173493 0.0196776 0.0660024 0.0050979 0.0658566 -0.1619787 -0.1616901 0.0000625 -0.0007189 0.0047752 -0.0662331 0.0236442 0.0007123 0.0234846 -0.1304866 -1.3359989 -0.1358243 -0.0617963 0.247795 -0.452507 -0.171061 0.0614082 -0.1760891 0.0279503 -0.3246666 0.1270136 0.0394162 0.2085961 0.0167883 0.0309127 0.0662039 0.0298371 -0.0626659 -0.4618939 -0.0075568 -0.0055189 -0.0489035 0.071816 0.0466847 -0.0176771 0.0472289 -0.0603105 1.4139074 -0.2480076 -0.0694263 -0.2796195 0.0128362 0.0482479 -0.0817667 0.0486446 -0.1264269 1.8337979 -0.1293699 -0.0176383 -0.3163166 1.149581 0.3507549 -0.0761809 0.3538991 0.1646732 1.5383859 -0.2544308 -0.0635131 0.4395061 1.9286014 0.6148951 0.1634333 0.6076882 0.2474389 -0.0790065 0.0744272 0.0226906 -0.2181533 0.4745562 0.1363975 -0.0727284 0.1394475 0.0921795 0.1922808 -0.0248238 -0.0091742 0.0612861 0.176661 -0.0370361 0.0186245 -0.0377278 0.281434 0.0283531 0.0959989 0.0300781 0.0801694 -0.0234599 -0.0620942 0.0247012 -0.0618314 0.1505469 0.1999762 -0.0273073 -0.0079642 -0.0379588 0.0720829 -0.0316657 -0.0116063 -0.0315525 0.1580833 0.0182799 -0.0667018 -0.0227901 -0.0712566 0.0408537 -0.0395237 -0.0239451 -0.0394806 0.1480678 0.0689322 0.032615 0.0098044 0.0548799 -0.0033053 -0.0510042 0.0171909 -0.0512345 0.1395324 unknown
polarizability: 340.850566|-12.4376823|205.5739552|-1.0947793|46.1960775|77.7866138 unknown
InChI: InChI=1S/C11H5BrCl2N4/c12-6-1-3-7(4-2-6)16-10-8(5-15)9(13)17-11(14)18-10/h1-4,16H
charge 0 multiplicity 1
23 atoms
Br -6.24536 0.584596 0.127549
Cl 5.006773 -0.744452 -0.182452
Cl 2.023844 3.507698 1.154589
N  -0.212662 -0.796486 -0.273461
N  0.915058 1.195897 0.387956
N  3.3386 1.276901 0.447801
N  2.199761 -3.273263 -1.043809
C  -1.579409 -0.399883 -0.158153
C  0.948287 -0.109066 -0.034721
C  -2.545017 -1.389548 -0.487022
C  -2.006807 0.888711 0.255137
C  2.226618 -0.779803 -0.235098
C  -3.921193 -1.104936 -0.405473
C  -3.386841 1.172299 0.336316
C  -4.332353 0.179948 0.008138
C  3.377932 -0.003829 0.033386
C  2.097161 1.795751 0.59806
C  2.260835 -2.134836 -0.67381
H  -0.079132 -1.764803 -0.586147
H  -2.2268 -2.38929 -0.808324
H  -1.269538 1.650663 0.507881
H  -4.656963 -1.872406 -0.65968
H  -3.714696 2.165736 0.655137
