program: Gaussian 09
title: 000250966
version: EM64L-G09RevD.01
frameworkgroup: C1[X(C16H27NO2S)]
method: RPBEPBE
basis: SDD
operation: Freq
keyword: #p
keyword: freq=noraman
keyword: PBEPBE/SDD
title: #p freq=noraman PBEPBE/SDD
converged: YES YES NO NO
title: Mulliken charges:
elementType: S O O N C C C C C C C C C C C C C C C C H H H H H H H H H H H H H H H H H H H H H H H H H H H
charge: 0.919761 -0.534900 -0.535595 -0.326875 -0.397714 -0.408462 -0.343948 -0.331372 -0.337611 -0.346103 -0.359782 -0.356539 0.000964 -0.695069 -0.694441 -0.243961 -0.282752 -0.205425 -0.207710 -0.218767 0.253920 0.218516 0.232969 0.230550 0.199631 0.232815 0.242411 0.185511 0.194767 0.179172 0.181966 0.187979 0.193957 0.205950 0.205474 0.193907 0.212578 0.207222 0.216790 0.208362 0.210370 0.217804 0.278264 0.297397 0.240330 0.240782 0.236906
chargesum: 0.00000
title: Mulliken charges with hydrogens summed into heavy atoms:
elementType: S O O N C C C C C C C C C C C C C C C C
charge: 0.919761 -0.534900 -0.535595 -0.326875 0.074722 0.055058 0.088498 0.096549 0.036327 0.023842 0.040125 0.042843 0.000964 -0.058479 -0.057905 0.034304 0.014645 0.034905 0.033072 0.018138
polarizability: 2.64227568e+02 -4.05209263e+00 2.07516940e+02 3.39351466e+00 1.67176660e+01 1.65954315e+02
1716.lowfreq: -4.2049 -2.1857 -0.0014 0.0007 0.0017 6.6228 17.9714 25.2473 27.5861
frequency: 17.8942 24.9791 27.5728 33.2936 44.4029 53.2410 57.4339 76.1925 100.8672 102.0384 114.1471 127.0070 135.9737 140.6348 161.8756 191.5486 197.1098 206.1736 225.3123 231.4159 246.4669 252.1009 302.3590 309.6941 336.4468 351.1138 378.7441 400.8636 403.4289 421.1106 451.7547 497.0901 505.6149 599.4773 603.4043 661.5652 690.6352 723.5055 731.9197 742.3648 757.2542 759.4844 793.5971 823.9907 829.5414 848.9214 860.7571 888.8022 909.2826 922.1688 932.8799 952.2364 971.8894 978.7885 983.0558 997.1811 1004.5730 1008.7266 1012.1972 1030.8098 1045.4044 1049.8966 1073.5510 1075.8222 1077.6564 1084.1501 1114.1426 1116.1882 1166.9919 1172.7297 1176.0447 1176.7144 1213.9750 1221.7353 1244.5401 1248.5229 1270.8826 1282.2353 1287.0643 1292.3023 1294.0753 1302.0047 1304.9472 1318.6806 1328.9988 1351.8159 1354.7212 1356.1830 1364.0681 1384.0807 1388.3207 1389.6706 1431.1464 1435.9371 1443.3383 1453.0846 1462.9234 1465.9087 1468.5596 1470.1922 1476.1454 1477.2870 1478.0819 1480.7312 1487.5822 1488.4774 1578.2520 1604.2198 2949.0232 2951.6150 2962.7230 2969.9926 2970.3717 2971.8314 2972.2108 2979.3059 2986.5039 2993.5779 2996.1573 2998.3029 3015.2309 3025.2755 3025.7104 3043.7425 3062.1285 3067.5442 3069.1052 3071.5164 3071.9620 3073.6928 3136.3248 3147.1816 3156.4288 3165.9008 3175.3164
redmass: 4.9371 3.5177 3.8183 4.4007 3.5983 1.6601 1.6135 4.2119 3.0021 3.1587 3.0571 2.0382 1.9959 5.4739 2.9416 5.2396 3.2724 5.3487 1.1287 1.1128 8.1568 4.6119 3.5078 3.3454 4.1366 3.8243 5.9082 3.8680 2.9240 3.9683 3.9762 4.2593 3.6802 4.5885 6.4048 7.0627 2.3024 1.0844 1.0716 1.1407 1.1730 1.4743 12.5426 1.2890 1.7930 1.2496 1.8252 1.9346 2.0095 13.3211 1.3742 1.2623 1.2908 4.4479 1.4959 3.2511 1.3363 4.0320 3.2487 3.4590 3.3591 2.1623 2.3027 1.5537 2.4202 1.8022 2.3532 2.3807 2.0189 1.0640 2.4930 1.1367 1.5352 1.4489 1.2632 1.2742 1.2774 1.1929 1.0772 1.1217 1.0891 1.3027 1.1643 1.2953 1.2581 1.5973 1.5731 1.2697 1.2238 8.3725 1.2159 1.2159 1.0832 2.1841 1.0871 2.0351 1.0742 1.0688 1.0718 1.0691 1.0431 1.0491 1.0639 1.0681 1.0847 1.0906 5.8398 6.9450 1.0586 1.0594 1.0598 1.0560 1.0563 1.0401 1.0399 1.0626 1.0673 1.0912 1.0902 1.0677 1.0982 1.1030 1.1021 1.0986 1.1039 1.1013 1.1013 1.0992 1.0994 1.1027 1.0857 1.0886 1.0929 1.0968 1.1011
irintensity: 0.9766 0.2106 0.2232 1.2431 1.2201 0.2837 0.1065 0.5265 1.0462 0.2230 0.2087 0.3693 0.1691 1.5587 0.6453 4.1159 0.4922 1.6315 0.0513 0.0324 10.4032 11.5908 2.3415 0.9993 3.7248 1.8825 10.2047 10.1920 1.0185 35.1577 17.7157 46.9638 15.2948 125.7393 4.1920 28.4279 36.4503 5.7049 13.4205 0.7835 0.2196 77.1172 62.5301 4.6444 24.7460 0.8528 4.4647 1.3638 5.3132 83.3943 1.9324 0.3116 2.7585 1.4051 0.4297 1.0363 0.3509 1.8303 28.0544 1.0729 20.0014 23.3697 2.2931 4.3437 3.0006 12.3543 4.5258 5.3868 4.3486 0.8232 17.4661 4.6726 7.1630 6.5185 6.5991 1.1750 10.8134 2.3389 1.7460 1.4143 2.2633 3.5904 11.2272 5.0630 6.0384 0.2120 0.2993 11.1824 6.4778 4.8297 13.5131 12.3168 16.2671 11.5979 6.5647 15.6047 0.1045 0.1070 0.6556 1.8509 10.9786 10.5537 8.5208 1.2088 8.7768 30.9771 3.4979 0.3731 14.3686 18.9622 18.6504 62.9088 45.0350 30.4495 27.4946 14.9969 32.8271 21.7221 14.1197 23.7182 16.4097 8.8355 23.8622 5.0727 8.5188 48.0806 59.5868 43.7733 57.5098 119.6148 1.0914 10.7488 2.4862 8.7231 25.5452
temp: 298.150 k
press: 1.00000 atm
elementType: 16 8 8 7 6 6 6 6 6 6 6 6 6 6 6 6 6 6 6 6 1 1 1 1 1 1 1 1 1 1 1 1 1 1 1 1 1 1 1 1 1 1 1 1 1 1 1
symmnumber: 1
zpe: 1049026.7 jmol-1
zpe.correction: 0.399553 hartree
zpe.thermalcorrener: 0.423762 hartree
zpe.thermalcorrenthalpy: 0.424706 hartree
zpe.thermalcorrgfe: 0.342144 hartree
zpe.sumelectzpe: -1227.399986 hartree
zpe.sumelectthermal: -1227.375777 hartree
zpe.sumelectthermalent: -1227.374833 hartree
zpe.sumelectthermalfe: -1227.457396 hartree
dipole: -2.1344 2.3825 -3.9640
dipole: 5.0936
quadrupole: -107.9683 -135.1403 -136.4552
quadrupole: 2.1027 0.9386 6.8945
quadrupole: 18.5530 -8.6190 -9.9340 2.1027 0.9386 6.8945
hfenergy: -1227.7995393 hartree
pointgroup: C01 [X(C16H27N1O2S1)]
dipole: 0.2874543 -0.8890453 -1.7728399 debye
polarizability: 244.0880355|-24.8817563|231.9457626|-11.886102|0.7091007|161.6650243 unknown
InChI: InChI=1S/C16H27NO2S/c1-3-5-10-14-17(15-11-6-4-2)20(18,19)16-12-8-7-9-13-16/h7-9,12-13H,3-6,10-11,14-15H2,1-2H3
charge 0 multiplicity 1
47 atoms
S  1.012135 0.489398 0.810385
O  0.233199 -0.490646 1.868896
O  1.467749 1.989511 1.257816
N  0.108063 0.727414 -0.801818
C  -0.633642 2.018193 -0.847327
C  -0.494795 -0.525647 -1.327489
C  -1.763712 2.269383 0.183452
C  -1.823906 -1.045279 -0.722808
C  -2.375367 3.677626 0.005579
C  -2.183974 -2.44194 -1.280528
C  -3.501199 3.975469 1.022947
C  -3.529701 -2.973233 -0.736496
C  2.534691 -0.469966 0.221492
C  -4.113418 5.381728 0.84693
C  -3.887409 -4.373925 -1.278924
C  3.517951 0.222457 -0.503781
C  2.63957 -1.81824 0.596741
C  4.671427 -0.496902 -0.892538
C  3.801322 -2.521171 0.197922
C  4.808609 -1.863144 -0.545894
H  0.117677 2.821963 -0.741986
H  -1.034545 2.073465 -1.880395
H  -0.619791 -0.350926 -2.416182
H  0.27601 -1.317231 -1.233694
H  -2.556908 1.505033 0.093934
H  -1.341947 2.183423 1.203712
H  -1.726675 -1.094767 0.377956
H  -2.647937 -0.343182 -0.95485
H  -1.577189 4.441154 0.113143
H  -2.777679 3.786166 -1.024422
H  -2.228318 -2.407465 -2.390239
H  -1.37852 -3.161294 -1.021948
H  -4.295812 3.208202 0.922532
H  -3.096744 3.871262 2.049768
H  -3.485921 -3.00179 0.370759
H  -4.335914 -2.257601 -0.997445
H  -3.343857 6.166744 0.971938
H  -4.553012 5.5008 -0.161679
H  -4.911751 5.570739 1.587951
H  -3.965511 -4.364669 -2.382754
H  -3.113362 -5.115282 -1.00407
H  -4.853107 -4.729762 -0.87528
H  3.392715 1.28269 -0.74377
H  1.850409 -2.283141 1.197294
H  5.460357 0.00902 -1.458793
H  3.919027 -3.574417 0.473291
H  5.706818 -2.412323 -0.848727
