program: Gaussian 09
title: 000250952
version: EM64L-G09RevD.01
frameworkgroup: C1[X(C12H14F3N3O2)]
method: RPBEPBE
basis: SDD
operation: Freq
keyword: #p
keyword: freq=noraman
keyword: PBEPBE/SDD
title: #p freq=noraman PBEPBE/SDD
converged: YES YES NO NO
title: Mulliken charges:
elementType: F F F O O N N N C C C C C C C C C C C C H H H H H H H H H H H H H H
charge: -0.180032 -0.144216 -0.138489 -0.230270 -0.290930 -0.364694 -0.472128 -0.661527 -0.045183 -0.558450 0.549935 -0.689903 -0.381314 -0.445093 -0.478079 -0.351202 0.478190 0.192598 0.303963 0.265465 0.252085 0.230898 0.205454 0.205688 0.222510 0.241428 0.334562 0.247980 0.229015 0.218623 0.308326 0.291920 0.347313 0.305555
chargesum: 0.00000
title: Mulliken charges with hydrogens summed into heavy atoms:
elementType: F F F O O N N N C C C C C C C C C C C C
charge: -0.180032 -0.144216 -0.138489 -0.230270 -0.290930 -0.030132 -0.180208 -0.008659 0.206902 -0.122098 0.549935 -0.020276 -0.133333 -0.216078 -0.259456 -0.042876 0.478190 0.192598 0.303963 0.265465
polarizability: 2.04289610e+02 -3.93998932e+01 1.44362211e+02 -1.02169142e+01 -2.43518266e+01 1.36370802e+02
1716.lowfreq: -8.7194 -0.0011 -0.0006 -0.0004 1.3656 6.6633 13.7315 22.0081 30.0667
frequency: 13.5381 21.9057 30.0095 43.0849 51.9079 58.9571 79.0903 101.5228 133.5182 157.7369 165.0953 212.7489 213.9342 239.9056 270.6482 280.0603 289.3637 317.4676 357.3246 364.4730 377.9837 386.1678 410.3535 431.6003 443.4903 482.8503 494.2359 515.2111 523.2977 552.5985 592.4990 629.3477 634.4688 643.5446 662.7735 707.2093 710.1735 718.6499 781.4362 811.6569 819.2767 839.0060 846.4577 867.8600 914.5681 939.9778 953.8360 974.0959 988.0528 1010.2858 1010.9094 1034.7235 1041.8910 1071.2605 1083.3083 1121.1109 1131.9617 1155.0797 1198.8091 1207.5935 1215.7095 1260.3401 1269.1758 1288.5055 1295.1763 1320.4263 1350.4925 1354.1699 1383.3583 1391.4372 1417.2959 1455.9145 1469.6611 1474.5115 1503.0735 1505.4616 1518.3345 1587.8925 1613.4361 1631.3644 1650.3604 1660.1964 2961.7603 2983.2500 3008.5972 3045.5126 3081.1442 3097.3138 3107.8628 3116.8288 3143.1371 3191.5222 3528.0163 3529.9148 3543.5928 3698.0563
redmass: 9.1121 15.9125 5.1505 10.7624 5.1889 4.6286 3.6923 4.5957 4.8968 4.4537 3.8501 1.1565 3.3525 7.4925 8.1314 1.4929 3.8141 3.8486 4.1228 5.2159 5.3144 4.5782 2.9765 5.3909 4.8293 3.1052 1.1940 4.1902 3.4960 3.3762 1.2161 7.1516 8.3038 1.4209 3.9205 11.4579 8.3537 3.4659 3.9622 5.7242 1.7529 3.3803 1.6576 1.8814 1.5761 1.8669 1.3858 4.1823 1.3310 3.5903 5.2359 12.3587 1.9361 2.5520 2.3024 3.3148 1.6719 2.2485 1.1753 1.3913 2.1280 2.2899 1.9762 2.5148 1.5188 1.5029 1.5493 1.3476 2.8278 1.3605 3.3192 1.1024 1.0908 1.0509 2.1632 1.6943 2.9662 3.6134 1.4564 5.2738 10.7740 3.6614 1.0599 1.0367 1.0985 1.0870 1.0981 1.1004 1.0887 1.0905 1.0950 1.0943 1.0775 1.0723 1.0494 1.1039
irintensity: 0.2577 1.2512 9.2531 8.3791 4.2845 6.4006 1.3232 0.5226 0.1882 12.3461 1.1302 0.9295 3.2756 5.2664 7.4247 17.5782 4.0785 14.5382 0.8506 1.8002 3.0214 4.3378 0.7505 9.1762 3.2785 16.1862 313.7582 3.5166 10.2302 11.9307 68.7131 7.3420 15.1860 144.7836 13.1886 13.0523 23.9225 1.7629 1.4038 49.2312 37.5789 1.5090 1.0319 27.9067 19.8775 18.1488 0.6174 2.1372 3.6823 55.2019 117.1299 240.0853 19.2327 35.2114 29.9325 83.1813 56.4288 88.1921 6.5345 24.1839 3.7844 9.0566 68.9351 47.1090 6.3441 63.1477 105.8551 4.7316 99.7449 57.8758 66.4696 9.7691 42.7589 11.8213 168.5311 113.7827 522.3496 98.8827 28.1320 17.4116 214.9313 275.1402 36.6567 28.9350 12.7949 4.2406 33.0291 24.1384 22.1542 15.8568 7.7929 6.1008 39.9134 12.5576 59.9528 42.8448
temp: 298.150 k
press: 1.00000 atm
elementType: 9 9 9 8 8 7 7 7 6 6 6 6 6 6 6 6 6 6 6 6 1 1 1 1 1 1 1 1 1 1 1 1 1 1
symmnumber: 1
zpe: 668561.2 jmol-1
zpe.correction: 0.254642 hartree
zpe.thermalcorrener: 0.274814 hartree
zpe.thermalcorrenthalpy: 0.275758 hartree
zpe.thermalcorrgfe: 0.202417 hartree
zpe.sumelectzpe: -1078.456971 hartree
zpe.sumelectthermal: -1078.436799 hartree
zpe.sumelectthermalent: -1078.435855 hartree
zpe.sumelectthermalfe: -1078.509195 hartree
dipole: 1.3931 1.7496 1.3897
dipole: 2.6331
quadrupole: -108.2786 -111.3092 -116.8968
quadrupole: -31.2020 23.4883 -5.5781
quadrupole: 3.8829 0.8524 -4.7353 -31.2020 23.4883 -5.5781
hfenergy: -1078.7116127 hartree
pointgroup: C01 [X(C12H14F3N3O2)]
dipole: 0.5541603 0.8545075 0.1894242 debye
polarizability: 206.4117664|-40.6654482|124.6196811|0.6972394|-16.0264015|153.9911764 unknown
InChI: InChI=1S/C12H14F3N3O2/c1-7(17-10(19)12(13,14)15)6-8-2-4-9(5-3-8)18-11(16)20/h2-5,7,17-18H,6,16H2,1H3
charge 0 multiplicity 1
34 atoms
F  -2.935346 -2.228153 -0.609439
F  -4.092072 -2.373852 1.341786
F  -1.841748 -2.632141 1.34237
O  -2.637327 0.059069 2.213801
O  4.902378 -0.363619 -1.561959
N  -2.698006 0.375165 -0.11634
N  3.773375 -0.148554 0.506922
N  5.912675 -1.103998 0.398021
C  -2.542342 1.848244 -0.099827
C  -1.303928 2.280351 -0.930047
C  0.014512 1.615099 -0.548411
C  -3.832091 2.531428 -0.604954
C  0.357907 1.326396 0.797661
C  0.965607 1.299658 -1.550261
C  1.60028 0.748998 1.119151
C  2.217674 0.724514 -1.249844
C  2.544379 0.440668 0.102487
C  -2.72476 -0.369216 1.030589
C  -2.894259 -1.895267 0.781159
C  4.855358 -0.523867 -0.306699
H  -2.391966 2.112688 0.961737
H  -1.220389 3.381475 -0.821115
H  -1.510324 2.099235 -2.004689
H  -4.046686 2.257373 -1.655225
H  -3.724775 3.630024 -0.557344
H  -4.69779 2.241302 0.014507
H  -2.743697 -0.103723 -1.020235
H  -0.344388 1.538439 1.611648
H  0.726543 1.508889 -2.600982
H  1.834109 0.527337 2.168915
H  2.939426 0.490804 -2.034344
H  3.861004 -0.311659 1.511887
H  6.719132 -1.388145 -0.152195
H  5.910936 -1.284658 1.399566
