program: Gaussian 09
title: 000250969
version: EM64L-G09RevD.01
frameworkgroup: C1[X(C18H18O4)]
method: RPBEPBE
basis: SDD
operation: Freq
keyword: #pfreq=noraman
keyword: PBEPBE/SDD
title: #p freq=noraman PBEPBE/SDD
converged: YES YES NO NO
title: Mulliken charges:
elementType: O O O O C C C C C C C C C C C C C C C C C C H H H H H H H H H H H H H H H H H H
charge: -0.265275 -0.266260 -0.279143 -0.268954 0.417358 -0.607843 0.347591 -0.554666 -0.357846 0.188467 0.168002 -0.463947 -0.511248 -0.689539 -0.203554 0.216364 0.215303 -0.340675 -0.335212 -0.220021 -0.217522 -0.222311 0.270473 0.207980 0.262228 0.210909 0.197758 0.264510 0.251408 0.228465 0.220052 0.210418 0.218943 0.240286 0.232778 0.269670 0.268235 0.233262 0.231279 0.232275
chargesum: 0.00000
title: Mulliken charges with hydrogens summed into heavy atoms:
elementType: O O O O C C C C C C C C C C C C C C C C C C
charge: -0.265275 -0.266260 -0.279143 -0.268954 0.417358 -0.129389 0.347591 -0.292438 0.050821 0.188467 0.168002 -0.199437 -0.031375 -0.040126 0.269510 0.216364 0.215303 -0.071005 -0.066978 0.013242 0.013757 0.009965
polarizability: 2.48465575e+02 2.46688149e-01 2.30625981e+02 9.03350725e-02 -1.79390085e+01 1.50902401e+02
1716.lowfreq: -0.0005 0.0003 0.0006 1.8999 5.9671 9.1290 17.7236 25.3129 41.0651
frequency: 16.3175 25.2731 41.0389 51.6275 68.7014 69.2366 80.4442 101.3287 117.1046 132.0822 158.0830 203.6131 220.0127 227.5238 263.3884 281.5100 289.7324 307.8631 356.3334 358.5204 392.1729 404.0600 423.9338 441.4693 460.6581 492.3326 527.5744 605.1906 614.9330 651.6875 662.2968 677.2221 680.9544 701.6144 716.6823 736.6994 748.6970 762.9563 772.8231 795.7643 821.6842 834.9957 856.2948 865.1718 866.9487 880.3419 884.9579 894.2224 955.4400 970.5694 990.2733 991.5556 996.6461 1004.5251 1008.8121 1018.1677 1047.9534 1050.9110 1070.5178 1075.4121 1085.3448 1093.8470 1125.7907 1161.9965 1164.9232 1174.0042 1180.9507 1218.0769 1225.9055 1241.0051 1262.2371 1270.7197 1288.1875 1291.2637 1314.5700 1339.4513 1344.2132 1360.9221 1389.8414 1390.4483 1417.4716 1420.1822 1438.6428 1459.3807 1472.1632 1474.8096 1475.5581 1478.5327 1484.2378 1486.4782 1508.0350 1583.7374 1610.9598 1615.9673 1621.2917 1623.2951 2972.0206 2974.6886 2987.9940 2999.3010 3015.9775 3044.5738 3048.0336 3071.4485 3074.3274 3107.1228 3116.0588 3130.0492 3142.9339 3155.5181 3162.3802 3166.0922 3167.4869 3179.6146
redmass: 5.2819 5.7526 4.2201 3.6468 6.6660 3.2181 3.2778 1.8190 4.4388 4.8251 5.7833 5.6372 5.2952 1.2251 5.4391 4.2813 3.9647 3.2671 6.1320 2.6103 4.2234 2.8264 3.4185 3.7206 5.8540 5.2863 4.4948 4.7081 6.4371 8.1851 6.5000 8.4283 5.4367 1.6076 4.1307 5.8552 1.1088 5.8687 5.6505 2.1802 2.9401 7.4394 3.5052 1.2501 1.5849 1.7434 1.5140 1.7151 1.4210 4.6025 4.4318 2.4648 1.3853 5.4589 1.3278 3.1261 2.5543 2.9814 1.4895 1.4891 1.6425 2.1118 1.0622 3.0616 1.6944 1.0574 1.1319 1.4355 1.4077 3.1628 1.3651 2.2939 1.5247 1.1993 1.3194 1.4342 1.3192 1.2901 1.2120 10.1523 5.3643 5.1276 2.2522 1.1310 1.9997 1.0597 1.0631 2.2652 1.0815 1.4147 1.0985 6.8521 6.4872 8.2377 8.3659 8.8806 1.0519 1.0433 1.0612 1.0606 1.0995 1.0612 1.1000 1.1005 1.0999 1.1106 1.1068 1.0855 1.0892 1.0940 1.0926 1.0931 1.0980 1.0975
irintensity: 0.1863 0.8791 0.2932 0.8147 1.5430 6.1635 6.8279 0.7929 2.4495 0.9750 0.6919 0.4907 5.1056 0.2294 2.3659 0.4116 2.5356 2.8277 0.2517 12.7782 1.0997 0.0277 12.2898 1.5868 6.6462 15.5797 11.3855 4.6014 0.7971 1.1848 2.6278 1.8722 12.9422 90.4384 1.6792 4.8649 9.3922 2.9269 18.2874 22.0244 1.5861 26.3393 108.1857 0.4866 32.6787 3.1731 14.4077 2.3188 4.3495 119.0867 17.0173 32.6976 0.0678 36.7948 0.4298 125.5580 172.9988 12.0474 4.1349 15.8294 20.9720 15.5401 0.0373 5.5300 36.1060 0.4138 55.1661 2.1328 77.4627 313.1089 32.5324 94.7572 24.6159 20.3824 2.4153 2.1204 31.4328 0.0770 11.6095 3.0541 0.5438 16.0234 16.2347 18.1021 133.0014 16.5391 5.2436 6.7138 14.9691 49.6887 12.5162 51.0218 15.8953 115.2056 11.9434 9.3718 30.7909 26.5632 40.6768 127.6298 14.2358 24.6646 9.6628 62.4616 51.5464 33.0670 3.5761 0.2580 11.4393 17.1914 5.8469 0.6605 22.3652 8.4555
temp: 298.150 k
press: 1.00000 atm
elementType: 8 8 8 8 6 6 6 6 6 6 6 6 6 6 6 6 6 6 6 6 6 6 1 1 1 1 1 1 1 1 1 1 1 1 1 1 1 1 1 1
symmnumber: 1
zpe: 833407.9 jmol-1
zpe.correction: 0.317428 hartree
zpe.thermalcorrener: 0.337556 hartree
zpe.thermalcorrenthalpy: 0.338501 hartree
zpe.thermalcorrgfe: 0.265880 hartree
zpe.sumelectzpe: -996.003856 hartree
zpe.sumelectthermal: -995.983728 hartree
zpe.sumelectthermalent: -995.982784 hartree
zpe.sumelectthermalfe: -996.055405 hartree
dipole: 0.4932 -1.5090 0.2615
dipole: 1.6090
quadrupole: -114.0455 -120.7777 -126.3602
quadrupole: -3.6178 -1.5443 1.4552
quadrupole: 6.3490 -0.3832 -5.9657 -3.6178 -1.5443 1.4552
hfenergy: -996.3212846 hartree
pointgroup: C01 [X(C18H18O4)]
dipole: -0.1004912 0.6247304 0.0181019 debye
polarizability: 248.2054775|-1.9318438|234.3138903|0.6913916|6.0266486|147.4745895 unknown
InChI: InChI=1S/C18H18O4/c1-2-6-14-9-16-17(22-12-21-16)10-15(14)11-20-18(19)13-7-4-3-5-8-13/h3-5,7-10H,2,6,11-12H2,1H3
charge 0 multiplicity 1
40 atoms
O  4.512857 1.041046 -1.596744
O  3.525628 2.601739 -0.063067
O  -1.197358 0.139805 1.099233
O  -1.924884 -1.616814 -0.258261
C  1.794011 -1.244872 -0.292298
C  1.288615 -2.674778 -0.437428
C  1.211048 -0.311962 0.619135
C  2.916922 -0.846878 -1.081398
C  1.84509 -3.633283 0.654667
C  3.403216 0.451377 -0.939886
C  2.821158 1.367738 -0.039641
C  1.735212 1.011879 0.752751
C  0.021468 -0.664893 1.486954
C  1.348226 -5.082109 0.465439
C  4.483108 2.473399 -1.192442
C  -2.076355 -0.449985 0.187828
C  -3.206606 0.456482 -0.170135
C  -4.193438 -0.033246 -1.065078
C  -3.313863 1.77173 0.352211
C  -5.27971 0.785886 -1.434077
C  -4.403128 2.587561 -0.020042
C  -5.386783 2.097433 -0.91198
H  0.18319 -2.699531 -0.421645
H  1.595315 -3.067382 -1.42619
H  3.379157 -1.547484 -1.782369
H  2.952617 -3.606188 0.633013
H  1.548143 -3.264478 1.657321
H  1.282451 1.723615 1.448811
H  -0.243979 -1.731668 1.439467
H  0.177354 -0.357084 2.533729
H  0.243916 -5.130918 0.504705
H  1.665597 -5.484936 -0.514938
H  1.746993 -5.750286 1.2506
H  5.486305 2.768357 -0.84829
H  4.12109 3.078738 -2.044989
H  -4.087832 -1.05069 -1.455719
H  -2.545675 2.137544 1.038909
H  -6.04044 0.406761 -2.124932
H  -4.486269 3.603103 0.382017
H  -6.231369 2.733971 -1.199142
