program: Gaussian 09
title: 000250938
version: EM64L-G09RevD.01
frameworkgroup: C1[X(C9H10N2O3)]
method: RPBEPBE
basis: SDD
operation: Freq
keyword: #p
keyword: freq=noraman
keyword: PBEPBE/SDD
title: #p freq=noraman PBEPBE/SDD
converged: YES YES NO NO
title: Mulliken charges:
elementType: O O O N N C C C C C C C C C H H H H H H H H H H
charge: -0.272702 -0.181331 -0.223071 -0.439450 -0.629919 0.128574 0.174111 -0.328626 -0.347490 0.126799 -0.253414 -0.207054 -0.534573 0.282311 0.244006 0.255874 0.233126 0.233069 0.333615 0.257842 0.247462 0.234526 0.318081 0.348234
chargesum: 0.00000
title: Mulliken charges with hydrogens summed into heavy atoms:
elementType: O O O N N C C C C C C C C C
charge: -0.272702 -0.181331 -0.223071 -0.105836 0.036396 0.128574 0.174111 -0.084620 -0.091616 0.126799 -0.020287 0.026015 0.205256 0.282311
polarizability: 1.52679889e+02 -1.18759050e+01 1.26270852e+02 -5.66738591e+00 2.30582974e-01 8.03456953e+01
1716.lowfreq: -41.7384 -3.3684 -0.0006 -0.0004 0.0004 7.7832 10.4309 38.2071 59.3224
frequency: -41.6772 38.2034 59.3178 80.3415 104.7163 165.8092 190.8249 203.0332 245.2486 252.3229 276.9863 339.2447 403.7173 447.0095 462.2354 496.4485 523.8816 543.9080 568.8034 574.0921 610.0292 649.8633 688.0022 728.5551 734.9607 757.6126 768.8961 855.9800 869.7368 904.2656 943.8935 969.2960 980.2252 1037.2048 1058.9372 1074.9418 1101.8774 1115.6972 1158.9004 1168.7340 1208.9528 1225.2845 1268.9251 1301.9158 1371.2662 1407.2017 1418.9402 1445.0858 1464.9779 1471.2795 1481.3595 1572.1292 1603.2137 1609.3948 1631.7598 1688.9079 2991.1473 3094.5628 3126.8986 3129.8804 3139.9421 3161.4002 3174.4549 3514.6234 3529.2872 3682.4325
redmass: 5.8549 6.5993 3.7791 4.6428 4.4407 4.7987 6.6610 6.4296 2.0068 1.4875 4.7425 4.8240 2.9211 4.5279 1.2911 3.5893 5.5337 5.0288 1.2276 3.4745 1.1634 6.1225 6.5847 4.9402 6.4807 1.6187 3.1194 1.7384 3.7516 4.1805 1.3955 8.4469 1.3128 2.3686 2.0117 2.9379 1.2527 1.8980 1.3134 1.0639 2.4311 3.1370 1.5557 3.4984 9.7995 2.1324 1.8734 1.5258 1.0792 1.7901 1.1108 6.8575 1.2576 6.2443 5.5170 6.5663 1.0310 1.1041 1.0875 1.1035 1.0890 1.0942 1.0999 1.0759 1.0466 1.1044
irintensity: 1.8723 11.0442 7.2482 1.8009 3.1494 2.7452 2.4658 0.5340 1.5856 0.6613 3.6666 2.6330 8.6263 1.7408 83.3172 27.1668 11.7977 21.1615 187.7095 34.1876 71.4817 3.0597 12.8363 13.7341 35.4883 76.3011 22.9775 0.8371 14.6055 12.8781 3.4828 37.1587 0.4031 19.4280 5.6016 39.7866 0.0133 48.7621 4.8886 3.6400 194.7327 105.8349 54.3824 78.1911 24.5237 685.7668 97.9509 2.9444 17.7490 46.7777 45.6665 23.3224 58.3877 29.4714 83.9811 402.2336 41.1928 25.3075 2.5282 19.4450 10.1930 16.2608 14.4785 12.8620 54.1580 34.1932
temp: 298.150 k
press: 1.00000 atm
elementType: 8 8 8 7 7 6 6 6 6 6 6 6 6 6 1 1 1 1 1 1 1 1 1 1
symmnumber: 1
zpe: 477722.6 jmol-1
zpe.correction: 0.181955 hartree
zpe.thermalcorrener: 0.194697 hartree
zpe.thermalcorrenthalpy: 0.195641 hartree
zpe.thermalcorrgfe: 0.142132 hartree
zpe.sumelectzpe: -683.109637 hartree
zpe.sumelectthermal: -683.096895 hartree
zpe.sumelectthermalent: -683.095951 hartree
zpe.sumelectthermalfe: -683.149459 hartree
dipole: 0.2660 -4.1419 -4.2824
dipole: 5.9637
quadrupole: -75.3236 -69.9701 -87.4621
quadrupole: 8.8556 10.3704 2.7892
quadrupole: 2.2616 7.6152 -9.8768 8.8556 10.3704 2.7892
hfenergy: -683.2915919 hartree
pointgroup: C01 [X(C9H10N2O3)]
dipole: 0.0730117 -1.8685449 1.41715 debye
dipolederiv: -0.4304956 -0.364782 -0.1111263 -0.3860024 -1.3641917 -0.2501981 -0.1132208 -0.3838006 -0.3960939 -0.6400119 -0.0803037 0.1352574 0.0914416 -0.4259046 0.2795778 -0.1556084 0.2018541 -0.7911132 -0.7948664 -0.1600382 -0.0539048 -0.1629355 -0.8712518 0.1666057 0.0368948 0.1239186 -0.3343834 -1.7825069 0.065997 -0.6168262 -0.0442887 -0.4790219 0.0282171 -0.5814971 0.0578762 -0.6397732 -0.8460824 0.3875904 -0.145255 0.4444956 -0.635431 0.2162597 -0.2472838 0.2453607 -0.9119847 -0.3018852 0.1005371 0.0450338 -0.2150847 -0.2727397 0.0234812 -0.1070425 -0.0964627 -0.2078603 0.1412504 0.1659175 0.1062808 0.1731402 1.22405 0.348553 0.1093866 0.47376 0.2368361 0.0463286 -0.0003678 -0.0791655 0.2314202 0.0862981 0.054251 -0.0224644 0.1117171 -0.0633586 -0.0926764 -0.2950391 -0.1575114 -0.0208618 -0.2873174 -0.017703 -0.0417931 0.0701443 -0.1203535 1.5833079 0.0411222 0.2549286 -0.2562558 0.430661 -0.5595148 0.6376247 -0.382541 1.2297532 -0.2450816 0.0701025 0.0312585 -0.0099421 -0.0484088 0.060547 0.0060354 0.0457067 -0.1616804 0.1394674 0.0446412 -0.0706233 -0.0279265 0.1244396 0.1115058 -0.0989216 0.0955712 -0.0728873 0.4783108 0.3874778 0.0713421 0.2104999 0.5347571 0.0149233 0.009254 -0.0838774 0.2194182 2.1497718 -0.0942137 0.6164228 0.0861599 1.3773864 -0.3797771 0.3868959 -0.4399783 0.5597592 0.0106953 0.0754686 0.0813338 0.0530988 0.0443991 -0.0498957 0.0838741 -0.0624568 0.0920539 0.0220764 0.0469613 0.0601119 0.0565885 0.0519795 -0.0683288 0.0764234 -0.0578943 0.1213741 0.067215 -0.0501079 0.0063726 -0.0679098 -0.0709484 -0.0901142 0.0094794 -0.0918881 0.128864 -0.0926616 -0.0825875 0.0407022 -0.0816455 0.0707378 -0.0117379 0.0468632 -0.0120633 0.1368549 0.1587795 -0.0467973 -0.0455062 -0.0127699 0.2106836 0.0994774 0.0692523 0.0745773 0.1927023 0.0493593 -0.1165076 -0.0125513 -0.0466391 0.0781284 -0.0389871 0.0329592 0.0812117 -0.0776341 -0.105594 -0.0620448 -0.0721486 0.0643621 0.019438 0.0609714 -0.0793417 0.0891016 0.0399893 0.0508882 0.0427311 0.0370308 0.0052235 -0.1231186 -0.077677 0.026561 -0.1019253 0.0878315 0.2097541 -0.0373736 -0.0779953 -0.0673279 0.1402357 0.0276933 -0.0257258 -0.0008177 0.3753002 0.2246576 -0.0383835 -0.0434613 -0.0168406 0.1851395 0.0518702 -0.0586047 0.0429062 0.3563854 unknown
polarizability: 148.0912883|15.7563517|130.0743741|1.6130553|7.8429063|81.130774 unknown
InChI: InChI=1S/C9H10N2O3/c1-14-7-5-3-2-4-6(7)8(12)11-9(10)13/h2-5,11H,10H2,1H3
charge 0 multiplicity 1
24 atoms
O  -1.608329 1.66601 0.922328
O  1.04623 0.669952 -1.518048
O  3.307626 1.197547 0.379019
N  1.543386 -0.393231 0.520906
N  3.669771 -0.875058 1.390717
C  -0.761714 -0.41114 -0.251326
C  -1.759513 0.380163 0.391748
C  -1.111669 -1.711308 -0.710004
C  -3.062997 -0.155988 0.57652
C  0.666533 0.040175 -0.501671
C  -2.406204 -2.235782 -0.530548
C  -3.383821 -1.447819 0.125355
C  -0.468143 2.525255 0.546939
C  2.894132 0.063211 0.718585
H  -0.350135 -2.306136 -1.228479
H  -3.803929 0.476594 1.07467
H  -2.651217 -3.236264 -0.900401
H  -4.397044 -1.836113 0.275334
H  1.135255 -1.004384 1.23446
H  -0.37486 2.609289 -0.548993
H  0.481811 2.157444 0.973692
H  -0.710072 3.504172 0.98665
H  3.406438 -1.856389 1.462173
H  4.616663 -0.5984 1.643979
