program: Gaussian 09
title: 000250997
version: EM64L-G09RevD.01
frameworkgroup: C1[X(C14H14N4O6S2)]
method: RPBEPBE
basis: SDD
operation: Freq
keyword: #p
keyword: freq=noraman
keyword: PBEPBE/SDD
title: #p freq=noraman PBEPBE/SDD
converged: YES YES NO NO
title: Mulliken charges:
elementType: S S O O O O O O N N N N C C C C C C C C C C C C C C H H H H H H H H H H H H H H
charge: 0.041865 0.056961 -0.257694 -0.255450 -0.218907 -0.203572 -0.284604 -0.263663 -0.639315 -0.630130 0.013557 0.022151 -0.386114 -0.475188 0.430018 0.430102 0.296468 0.303834 0.375709 0.369582 -0.349613 -0.280962 -0.520185 -0.516772 -0.535098 -0.541087 0.289013 0.281398 0.304373 0.313754 0.337623 0.365422 0.330708 0.369703 0.251621 0.228075 0.229814 0.239432 0.220899 0.256270
chargesum: 0.00000
title: Mulliken charges with hydrogens summed into heavy atoms:
elementType: S S O O O O O O N N N N C C C C C C C C C C C C C C
charge: 0.041865 0.056961 -0.257694 -0.255450 -0.218907 -0.203572 -0.284604 -0.263663 0.063730 0.070282 0.013557 0.022151 -0.386114 -0.475188 0.430018 0.430102 0.296468 0.303834 0.375709 0.369582 -0.060600 0.000436 -0.215812 -0.203018 0.174412 0.175514
polarizability: 5.05299133e+02 -6.05071103e+00 3.04677944e+02 2.09308393e+01 -6.55840490e-01 1.47817476e+02
1716.lowfreq: -6.9612 -3.6971 -0.0009 0.0007 0.0013 5.4937 12.6432 19.3140 28.9982
frequency: 12.3316 19.1638 28.9873 45.0401 48.5441 67.1443 73.5921 94.7139 97.7612 109.5423 126.7030 161.5445 164.7137 169.5559 174.7203 198.5672 207.5446 221.6955 228.4898 240.5826 252.8031 308.2789 310.2645 313.8315 345.4085 350.5661 372.0306 374.5054 374.8644 379.2427 398.8338 407.6608 425.1804 427.1079 475.4411 479.3324 505.8213 513.2736 576.9391 585.8173 603.6180 612.1145 628.0655 634.3915 678.7537 682.3739 696.7979 697.6861 722.3218 732.3017 744.1842 744.8419 768.2785 771.6637 812.1074 814.1315 881.7933 887.2997 891.9660 899.5820 910.8195 923.7763 1004.5956 1007.3103 1040.1498 1045.6897 1065.0013 1072.3595 1113.0010 1115.9848 1150.9060 1153.6663 1170.3720 1174.3381 1213.3188 1215.3325 1238.5633 1243.9885 1316.7718 1325.2097 1325.6342 1334.9025 1388.5920 1395.0475 1408.3556 1414.6081 1438.2957 1442.1691 1467.1300 1471.0625 1471.8792 1472.3289 1482.9792 1491.9401 1529.8776 1533.9961 1559.3639 1560.1537 1622.7072 1625.0398 2964.4003 2966.1934 3056.3816 3057.3600 3136.3001 3137.4599 3174.2817 3175.3545 3188.6813 3190.0582 3391.7991 3394.3210 3572.8429 3575.0667
redmass: 7.1635 8.4758 9.1604 9.2203 7.3303 8.7399 7.5310 4.1904 3.7714 7.3195 8.2739 3.5707 3.6913 4.2226 3.9682 5.1563 9.6934 6.2875 2.3074 1.2593 2.3145 8.3259 5.4681 5.3448 10.3806 9.0072 5.4504 4.6176 5.4729 5.4277 7.8605 9.0978 7.2785 7.2676 5.7480 5.7529 5.5105 5.5099 3.2180 3.2351 4.1546 3.9093 1.2363 1.2209 6.1277 5.7203 11.1841 10.8940 2.4424 3.0813 1.3857 1.5789 5.8659 6.0815 7.3455 6.9571 1.4865 1.5278 7.4032 7.0493 1.3968 1.3873 5.8879 5.2667 1.9414 1.9321 2.4206 2.2617 1.2605 1.2564 1.7668 1.4517 4.7877 4.1059 3.0232 3.1404 1.4333 1.4794 5.3038 3.7861 4.4623 6.0878 4.5034 3.9165 5.0611 4.4803 1.3027 1.2083 1.0494 1.0775 1.0957 1.0770 2.8026 2.6269 2.7258 2.3334 2.3554 2.6874 6.3666 6.2204 1.0334 1.0329 1.1043 1.1048 1.0999 1.0993 1.0914 1.0927 1.0906 1.0917 1.0478 1.0478 1.1022 1.1023
irintensity: 0.1804 0.3248 1.5209 1.2979 0.5547 1.0255 2.3035 0.9589 6.2355 0.0929 2.1894 4.5072 6.1818 2.1149 1.5477 1.7453 5.6843 3.4503 3.1718 0.1413 2.3967 6.8209 8.1911 2.4895 6.5476 7.0164 9.8160 12.0941 4.2123 1.8485 0.1385 8.0167 17.1292 15.6664 5.8626 5.7060 18.0062 18.3611 19.9213 14.3011 4.7445 12.2220 47.2407 128.8935 14.0222 3.1378 10.1635 7.6149 12.4013 5.6645 113.6481 121.7217 20.2383 13.3490 17.6953 19.8083 19.0629 37.5546 3.8847 4.7464 3.8476 16.3745 144.9312 41.5617 5.9673 30.8123 5.5046 2.2144 0.0840 1.7969 85.2967 23.7160 506.0705 159.6351 86.0650 212.3233 208.3659 113.2863 95.6238 221.4861 125.8641 100.3279 29.9662 33.8810 85.7147 149.2926 14.1786 10.5531 16.2284 40.9111 61.5440 40.4209 62.0043 151.7317 224.9583 82.6075 315.6598 304.8557 32.9796 36.0458 29.1975 60.0525 37.8874 31.4612 22.9326 15.0314 1.7351 0.9273 8.3296 19.0252 32.1639 112.2469 82.6728 85.8238
temp: 298.150 k
press: 1.00000 atm
elementType: 16 16 8 8 8 8 8 8 7 7 7 7 6 6 6 6 6 6 6 6 6 6 6 6 6 6 1 1 1 1 1 1 1 1 1 1 1 1 1 1
symmnumber: 1
zpe: 732653.7 jmol-1
zpe.correction: 0.279053 hartree
zpe.thermalcorrener: 0.304681 hartree
zpe.thermalcorrenthalpy: 0.305625 hartree
zpe.thermalcorrgfe: 0.220990 hartree
zpe.sumelectzpe: -2006.300610 hartree
zpe.sumelectthermal: -2006.274982 hartree
zpe.sumelectthermalent: -2006.274038 hartree
zpe.sumelectthermalfe: -2006.358673 hartree
dipole: 5.3838 -2.5094 2.3053
dipole: 6.3715
quadrupole: -184.1849 -174.9604 -164.4901
quadrupole: -4.9807 1.5416 6.1903
quadrupole: -9.6398 -0.4152 10.0550 -4.9807 1.5416 6.1903
hfenergy: -2006.5796629 hartree
pointgroup: C01 [X(C14H14N4O6S2)]
dipole: -2.0018904 1.2483604 0.8472578 debye
polarizability: 499.4728447|-22.5834593|301.6631374|-43.253251|-24.277155|156.6585707 unknown
InChI: InChI=1S/2C7H7N2O3S/c2*1-12-4-2-5(9(10)11)7(8)6(13)3-4/h2*2-3H,8H2,1H3
charge 0 multiplicity 1
40 atoms
S  -0.449956 2.318745 -1.240481
S  0.918874 2.350798 0.754524
O  -5.20886 2.389867 0.746587
O  2.120911 -2.747963 1.431073
O  -4.361704 -2.587388 0.420241
O  6.152011 -1.148022 -0.820796
O  -2.267004 -2.829917 -0.451946
O  5.883657 1.062694 -1.297745
N  -0.910186 -0.71129 -1.184265
N  3.665845 2.29268 -0.602781
N  -3.27403 -2.07522 -0.058894
N  5.4498 -0.065866 -0.788588
C  -1.925197 1.444348 -0.634477
C  2.011063 0.918299 0.562807
C  -1.963713 -0.007488 -0.673824
C  3.293332 1.083703 -0.090382
C  -3.150957 -0.629399 -0.146205
C  4.12637 -0.098077 -0.16285
C  -4.19197 1.532902 0.315321
C  2.441777 -1.469144 0.969065
C  -3.014241 2.18141 -0.154439
C  1.605562 -0.330525 1.080471
C  -4.253233 0.132142 0.33153
C  3.702761 -1.340613 0.352392
C  -6.44415 1.767293 1.238001
C  0.781915 -2.951989 2.0040
H  -2.970136 3.273797 -0.130495
H  0.624366 -0.395549 1.55777
H  -5.116481 -0.422258 0.706133
H  4.363455 -2.206617 0.266225
H  -0.114839 -0.191024 -1.561719
H  -0.978415 -1.735589 -1.193355
H  3.028609 3.084796 -0.494091
H  4.588469 2.360589 -1.047964
H  -7.10092 2.606815 1.505937
H  -6.248589 1.143307 2.131295
H  -6.920805 1.152666 0.450309
H  -0.011614 -2.736922 1.262418
H  0.636819 -2.33235 2.909799
H  0.751206 -4.01624 2.275999
