program: Gaussian 09
title: 000250940
version: EM64L-G09RevD.01
frameworkgroup: C1[X(C11H11N5O2)]
method: RPBEPBE
basis: SDD
operation: Freq
keyword: #p
keyword: freq=noraman
keyword: PBEPBE/SDD
title: #p freq=noraman PBEPBE/SDD
converged: YES YES NO NO
title: Mulliken charges:
elementType: O O N N N N N C C C C C C C C C C C H H H H H H H H H H H
charge: -0.303816 -0.264208 -0.353255 -0.057270 -0.002516 -0.361508 -0.504758 0.088513 0.065556 0.085103 -0.484007 0.188294 -0.337408 -0.307014 -0.380407 -0.210887 -0.213339 0.206691 0.250013 0.258107 0.349619 0.262787 0.267567 0.287403 0.240882 0.241238 0.384712 0.302094 0.301815
chargesum: 0.00000
title: Mulliken charges with hydrogens summed into heavy atoms:
elementType: O O N N N N N C C C C C C C C C C C
charge: -0.303816 -0.264208 -0.003637 -0.057270 -0.002516 0.023205 0.099150 0.088513 0.065556 0.085103 0.024114 0.188294 -0.074621 -0.039447 -0.093004 0.029995 0.027898 0.206691
polarizability: 2.73077579e+02 1.32384660e+01 1.64962263e+02 1.35747973e+01 -2.71864421e-01 8.67504068e+01
1716.lowfreq: -10.1579 -4.9397 -0.0009 -0.0007 -0.0006 5.0457 27.8751 38.9529 53.0811
frequency: 27.8442 38.9319 53.0772 76.1964 93.2595 109.3365 127.5536 172.8617 184.6503 233.8384 241.7747 267.2722 281.7647 345.0094 347.0388 411.1933 416.3456 489.2229 492.5087 499.2211 526.9830 582.1920 594.6966 608.1071 633.8013 707.7407 722.3717 741.1820 749.2199 759.3995 771.6142 780.0163 800.1731 808.1460 872.1334 890.0994 921.1272 942.0960 946.5698 976.5308 977.1750 1003.2856 1009.5611 1019.2495 1112.8013 1144.3974 1155.2949 1174.8007 1195.3096 1238.1574 1249.1396 1271.9068 1277.3549 1280.0768 1290.3316 1324.1407 1328.7585 1372.7101 1413.9095 1439.3416 1454.8348 1477.8694 1484.8881 1504.1223 1514.0917 1550.0546 1587.5894 1616.4748 1633.3255 1674.4624 3013.1768 3116.6299 3140.2864 3153.1138 3167.1912 3167.7752 3177.4717 3370.9753 3395.4591 3484.1448 3509.1237
redmass: 5.9368 6.4394 6.7233 2.6633 3.5699 2.2866 6.1005 3.0871 3.3537 5.8114 4.2343 4.0651 6.5649 7.5135 4.6750 4.0736 3.4959 4.3375 3.7945 5.6495 6.9532 7.0604 4.9091 8.8596 4.3546 1.2084 3.9054 3.5581 4.6040 1.6825 1.9903 1.4579 1.9275 2.9880 5.4529 1.7117 5.1097 5.0021 1.4507 2.6846 1.3670 1.3364 2.2724 4.0601 1.8137 2.8720 1.5441 2.1371 1.8146 1.7739 2.1004 2.7943 2.0608 1.2473 1.7692 2.2826 1.3919 2.5727 4.6350 1.1218 2.7428 3.5127 1.6298 2.2440 7.2057 6.9197 8.1449 6.4596 5.7643 1.0781 1.0640 1.0997 1.0863 1.0898 1.0956 1.0937 1.1004 1.0786 1.0486 1.0779 1.0988
irintensity: 1.3311 3.7005 8.1145 14.7718 11.1816 2.1054 11.2448 5.4625 13.6253 0.4749 23.6638 7.6642 2.4456 11.3468 17.8435 19.9564 19.6345 0.7606 2.6153 4.1977 1.1450 2.8950 5.3518 0.8002 1.0437 76.3361 31.6372 11.7838 12.4049 118.8019 120.8816 94.9064 72.7766 25.3386 5.4949 0.0329 20.1430 8.4296 10.9022 0.9182 6.2380 0.0170 3.2861 13.6275 10.9745 21.8810 5.6608 5.0199 4.8535 23.8095 2.4498 8.2468 1.4832 0.2960 17.4171 0.8766 4.9179 30.7443 17.3763 25.8615 2.3226 47.2845 172.6543 176.8867 2.9750 17.0044 72.9319 0.5689 340.9426 6.5129 21.7219 4.5170 1.9506 4.9723 9.7726 1.2624 22.0011 112.3338 26.1848 55.2333 1.2563
temp: 298.150 k
press: 1.00000 atm
elementType: 8 8 7 7 7 7 7 6 6 6 6 6 6 6 6 6 6 6 1 1 1 1 1 1 1 1 1 1 1
symmnumber: 1
zpe: 572496.0 jmol-1
zpe.correction: 0.218052 hartree
zpe.thermalcorrener: 0.233858 hartree
zpe.thermalcorrenthalpy: 0.234802 hartree
zpe.thermalcorrgfe: 0.173110 hartree
zpe.sumelectzpe: -848.690946 hartree
zpe.sumelectthermal: -848.675140 hartree
zpe.sumelectthermalent: -848.674196 hartree
zpe.sumelectthermalfe: -848.735888 hartree
dipole: 4.4467 2.2529 -0.5500
dipole: 5.0151
quadrupole: -92.8663 -111.4228 -102.8030
quadrupole: 11.2825 5.4165 -2.1777
quadrupole: 9.4977 -9.0588 -0.4390 11.2825 5.4165 -2.1777
hfenergy: -848.908998 hartree
pointgroup: C01 [X(C11H11N5O2)]
dipole: -1.765193 -0.7879915 -0.3953708 debye
polarizability: 271.4163834|19.0016759|157.3360372|-17.9092085|22.5876551|96.037828 unknown
InChI: InChI=1S/C11H11N5O2/c12-16-10(17)6-14-11(18)9-5-13-7-3-1-2-4-8(7)15-9/h1-5,14,16H,6,12H2
charge 0 multiplicity 1
29 atoms
O  2.045918 1.784338 -0.402267
O  4.909434 -1.846956 -0.414994
N  1.852725 -0.41024 -1.181822
N  -0.757913 -0.506126 -0.490322
N  -2.063076 1.776114 0.681589
N  4.426681 0.313581 0.337647
N  5.289097 0.262524 1.468647
C  -2.098027 -0.562757 -0.14431
C  -2.755914 0.591046 0.44547
C  -0.109362 0.655153 -0.250487
C  3.23973 -0.501604 -1.654646
C  1.348909 0.731366 -0.615309
C  -2.841434 -1.762477 -0.368638
C  -4.138597 0.508653 0.791782
C  -0.762171 1.794087 0.337074
C  -4.193053 -1.814225 -0.019296
C  -4.843483 -0.676269 0.561982
C  4.270759 -0.757777 -0.523151
H  3.324245 -1.339285 -2.362994
H  3.495835 0.442411 -2.170877
H  1.207342 -1.205191 -1.255866
H  -2.325244 -2.619086 -0.812919
H  -4.610242 1.390961 1.234753
H  -0.190267 2.709527 0.511926
H  -4.766295 -2.731788 -0.188936
H  -5.903955 -0.741763 0.827383
H  3.823918 1.145944 0.240072
H  5.081817 -0.569156 2.040358
H  6.274422 0.251995 1.16885
