program: Gaussian 09
title: 000250939
version: EM64L-G09RevD.01
frameworkgroup: C1[X(C11H11BrN6O)]
method: RPBEPBE
basis: SDD
operation: Freq
keyword: #p
keyword: freq=noraman
keyword: PBEPBE/SDD
title: #p freq=noraman PBEPBE/SDD
converged: YES YES NO NO
title: Mulliken charges:
elementType: Br O N N N N N N C C C C C C C C C C C H H H H H H H H H H H
charge: 0.005943 -0.336174 -0.446256 -0.145277 -0.351422 -0.109846 -0.023517 -0.567170 0.258302 0.418548 -0.165996 0.221224 -0.429829 -0.313475 -0.003863 -0.149402 -0.168453 -0.236889 -0.610867 0.348018 0.252350 0.310320 0.354844 0.251287 0.245306 0.246169 0.219916 0.252681 0.338824 0.334704
chargesum: 0.00000
title: Mulliken charges with hydrogens summed into heavy atoms:
elementType: Br O N N N N N N C C C C C C C C C C C
charge: 0.005943 -0.336174 -0.098238 -0.145277 0.003421 -0.109846 -0.023517 0.106358 0.258302 0.418548 -0.165996 0.221224 -0.177479 -0.003155 -0.003863 0.101885 0.076854 -0.236889 0.107899
polarizability: 3.86397343e+02 -1.76652147e+00 2.15204859e+02 -4.46480401e-01 2.60494151e-02 7.21186305e+01
1716.lowfreq: -1.8908 -0.0001 0.0004 0.0008 2.3046 3.2943 28.2394 35.4054 45.2559
frequency: 28.1983 35.4027 45.1741 62.3834 66.4113 118.6239 142.8955 157.2404 170.7393 192.9106 206.8435 220.8285 262.7518 277.9862 306.0620 313.8966 345.9231 388.2783 410.5336 421.6297 423.6250 502.9517 516.4968 521.2251 560.5884 573.8415 619.8876 626.1316 664.4239 680.9054 711.3125 712.5750 718.7919 720.5103 785.5161 797.5613 811.6425 823.3322 846.5547 954.4517 980.3070 987.8822 991.6203 1006.5744 1021.1275 1054.8906 1060.0170 1113.1089 1120.7288 1162.3132 1164.9249 1177.7429 1187.2066 1252.6573 1283.8923 1291.9480 1312.7724 1348.3640 1371.4803 1400.6309 1419.2815 1431.4755 1458.2438 1464.0278 1475.4091 1489.0386 1496.9384 1553.3114 1569.5184 1585.5637 1597.4023 1620.2592 1639.5669 2864.1408 2990.4309 3072.0599 3114.4035 3137.6951 3162.1526 3173.6235 3194.5270 3480.3134 3550.0737 3709.5950
redmass: 5.4101 1.0495 3.8846 7.4157 7.3135 5.3852 5.3540 7.3998 5.3190 6.0355 5.9424 6.4414 10.2202 5.6054 4.8617 6.7124 7.0189 3.7442 3.2258 7.3921 7.0617 6.9357 1.2259 3.0216 1.0632 7.4705 6.9315 7.7062 4.1786 4.9186 3.4102 1.3915 8.6178 5.9804 7.7613 9.2743 4.9487 1.3629 1.4305 1.3472 4.0772 1.3232 4.7751 3.4076 1.1259 2.5085 2.4896 1.4099 1.2892 3.4404 2.1631 3.7512 1.1791 3.4367 5.5526 1.4372 2.4030 5.6127 5.4258 4.0447 3.8740 1.2907 1.0486 2.5196 2.6164 1.1101 2.7640 4.3604 5.4499 2.6063 5.8540 2.2664 1.7168 1.0879 1.0353 1.0995 1.1015 1.0902 1.0909 1.0956 1.0951 1.0774 1.0444 1.1059
irintensity: 0.1566 0.0109 0.7681 0.3425 1.0973 2.3006 1.1270 0.6293 2.4691 3.0245 3.4608 5.6312 4.6782 11.2397 15.8231 1.4684 5.4696 10.9949 1.6128 3.7284 8.6889 5.3234 261.1994 35.2060 5.7784 8.5149 0.4882 7.6037 4.2621 1.1321 5.6440 71.4262 6.3368 3.6715 36.7941 2.9609 34.2049 11.5452 60.4983 0.2547 2.1318 3.4716 60.6886 7.2701 99.7257 14.4939 32.4653 21.9759 3.6914 6.4355 5.2868 153.5617 2.3470 53.8219 68.1256 1.8303 6.4677 311.2397 37.6393 55.3829 360.3156 66.6788 19.8325 67.8434 139.8867 2.0257 206.5560 934.5779 80.7858 581.9833 2.9307 261.4290 292.8085 137.0876 71.0830 26.2485 20.3992 5.0732 3.7461 3.7282 13.2977 68.4608 153.8463 48.5403
temp: 298.150 k
press: 1.00000 atm
elementType: 35 8 7 7 7 7 7 7 6 6 6 6 6 6 6 6 6 6 6 1 1 1 1 1 1 1 1 1 1 1
symmnumber: 1
zpe: 575919.8 jmol-1
zpe.correction: 0.219356 hartree
zpe.thermalcorrener: 0.236820 hartree
zpe.thermalcorrenthalpy: 0.237765 hartree
zpe.thermalcorrgfe: 0.171645 hartree
zpe.sumelectzpe: -841.596791 hartree
zpe.sumelectthermal: -841.579327 hartree
zpe.sumelectthermalent: -841.578383 hartree
zpe.sumelectthermalfe: -841.644502 hartree
dipole: -4.2085 4.1382 0.0054
dipole: 5.9022
quadrupole: -101.8353 -110.8466 -124.2736
quadrupole: -12.4950 0.0170 -0.0319
quadrupole: 10.4832 1.4719 -11.9551 -12.4950 0.0170 -0.0319
hfenergy: -841.8161473 hartree
pointgroup: C01 [X(C11H11Br1N6O1)]
dipole: -1.7062198 -1.5154584 0.429426 debye
polarizability: 386.0646249|-5.8269774|206.9809643|-8.0579502|-33.395347|80.6752428 unknown
InChI: InChI=1S/C11H11BrN6O/c1-14-9-8(18-19)10(17-11(13)16-9)15-7-4-2-6(12)3-5-7/h2-5,14-15H,13H2,1H3
charge 0 multiplicity 1
30 atoms
Br 6.547496 -0.612066 -0.089714
O  -0.973656 2.868286 -0.71913
N  0.509346 0.776633 -0.245141
N  -0.630125 -1.262423 0.299542
N  -4.314169 0.688296 -0.064727
N  -3.104386 -1.276834 0.379227
N  -2.065215 2.134852 -0.500192
N  -1.844556 -3.180024 0.814583
C  -0.640558 0.062013 -0.029508
C  1.866543 0.383794 -0.190914
C  -1.892906 0.80388 -0.173743
C  -3.12311 0.04469 0.054288
C  2.828375 1.394726 -0.475496
C  2.311136 -0.929916 0.123669
C  -1.859192 -1.851556 0.483751
C  4.20596 1.107229 -0.447561
C  3.691952 -1.218605 0.151674
C  4.626632 -0.202608 -0.132515
C  -5.611436 0.036639 0.132828
H  0.273379 1.783084 -0.488985
H  2.494902 2.410007 -0.719383
H  1.570217 -1.700169 0.340224
H  -4.242486 1.679682 -0.321438
H  4.936153 1.890859 -0.667358
H  4.031337 -2.230062 0.393826
H  -5.807062 -0.714765 -0.654007
H  -6.402145 0.803309 0.104728
H  -5.641089 -0.483654 1.105536
H  -2.728966 -3.661099 0.959797
H  -0.954069 -3.662497 0.906439
