program: Gaussian 09
title: 000250968
version: EM64L-G09RevD.01
frameworkgroup: C1[X(C17H21NO4S)]
method: RPBEPBE
basis: SDD
operation: Freq
keyword: #p
keyword: freq=noraman
keyword: PBEPBE/SDD
title: #p freq=noraman PBEPBE/SDD
converged: YES YES NO NO
title: Mulliken charges:
elementType: S O O O O N C C C C C C C C C C C C C C C C C H H H H H H H H H H H H H H H H H H H H H
charge: 0.331384 -0.248942 -0.262567 -0.263226 -0.235032 0.007604 -0.262981 0.455628 0.328768 -0.521977 -0.528635 0.160118 -0.479026 0.162978 -0.700415 -0.696511 -0.342074 -0.576061 -0.334626 -0.202213 0.313494 -0.686142 -0.362564 0.253301 0.261535 0.236247 0.247641 0.264332 0.205266 0.223395 0.228447 0.220351 0.221276 0.215975 0.236897 0.247460 0.326202 0.210337 0.216383 0.242980 0.237183 0.210434 0.221977 0.215399
chargesum: 0.00000
title: Mulliken charges with hydrogens summed into heavy atoms:
elementType: S O O O O N C C C C C C C C C C C C C C C C C
charge: 0.331384 -0.248942 -0.262567 -0.263226 -0.235032 0.007604 -0.009679 0.455628 0.328768 -0.260442 -0.044747 0.160118 -0.214694 0.162978 -0.043307 -0.038910 0.142283 -0.249859 0.092094 0.277950 0.313494 -0.038331 -0.362564
polarizability: 2.78245414e+02 1.75394742e+01 2.15359611e+02 -9.60120618e+00 1.18565491e+01 1.71857646e+02
1716.lowfreq: -13.5286 -8.8016 -4.1595 -0.0016 -0.0004 0.0009 6.5313 13.4749 25.3824
frequency: 0.4338 12.2467 23.9367 34.3590 38.7577 41.3946 53.9771 73.7965 77.9425 83.6403 96.1030 118.2199 135.8051 152.3943 173.5169 208.5655 218.8806 225.3425 226.6619 238.3305 251.9558 270.3741 282.8216 287.8484 302.3718 337.3197 373.7727 383.9137 394.6588 414.2417 434.0623 455.8059 490.2751 498.0859 532.1252 572.3212 610.1138 630.7376 646.3270 669.4177 677.6468 716.6077 725.7053 735.7474 748.8299 764.9839 796.6783 810.6990 837.8646 845.3864 874.6817 876.9657 880.2230 886.9438 912.6117 920.5985 957.6396 969.3015 987.5177 993.8999 1012.7039 1063.7775 1065.6028 1073.4623 1098.7065 1106.5901 1110.6827 1117.9971 1121.8921 1124.2394 1166.5224 1187.3156 1205.9142 1221.5288 1231.4071 1247.3963 1263.0635 1271.4886 1302.2895 1310.0616 1317.6854 1337.3261 1344.1653 1362.7155 1368.5581 1377.9628 1392.0360 1396.4825 1412.3740 1422.0004 1449.7930 1465.7288 1468.4524 1471.3953 1472.7408 1477.5275 1478.7079 1482.0159 1484.9569 1486.6214 1490.1397 1618.7555 1622.2974 1624.4586 2097.7751 2972.9505 2976.6088 2978.2416 2979.1606 2986.4553 3010.6314 3025.9158 3037.8924 3049.0470 3056.1038 3065.3623 3068.8035 3074.5544 3074.9482 3079.7391 3080.3490 3080.7903 3102.8527 3125.5779 3163.8607 3173.2031
redmass: 5.1261 5.9446 5.6407 2.5242 2.7303 4.9800 5.4657 2.5127 3.8525 3.7949 7.3522 4.6279 6.6888 5.2714 3.3913 4.4365 1.4241 1.3540 4.4853 2.4901 1.1195 3.1506 3.0634 3.6404 3.7687 3.5104 4.4387 12.6924 3.9754 2.7221 8.7782 4.4112 5.5616 3.7819 3.4081 4.6124 8.4092 5.7424 5.5261 6.4723 9.0026 4.8174 3.8350 4.4334 1.3720 4.8290 4.3888 3.9288 6.0338 3.2815 1.5951 1.6662 2.1597 1.5909 1.9428 1.2155 1.4119 4.3046 2.1198 3.8559 2.6233 2.1842 1.4735 1.6675 2.3041 2.0611 2.6404 1.7618 1.7108 1.2996 2.0834 1.8164 1.3910 1.4288 1.3672 1.4648 1.5835 3.3974 1.1130 1.3030 1.3357 1.3610 1.5509 1.3026 1.5026 1.1939 1.2117 1.3262 3.4038 3.0687 1.0796 1.0504 1.1181 1.6388 1.0780 1.1376 1.0450 1.0526 1.0723 1.2353 1.2748 9.2872 7.8350 10.0259 12.7327 1.0347 1.0369 1.0441 1.0507 1.0600 1.0572 1.0984 1.0848 1.1027 1.0588 1.0854 1.0998 1.1005 1.1013 1.0993 1.0997 1.0973 1.1148 1.1079 1.0930 1.0920
irintensity: 0.2272 0.9876 0.1803 11.3752 3.2985 3.0112 0.5251 0.1701 0.6485 0.5811 4.0786 0.6768 2.0198 2.3180 1.4592 1.0708 0.4360 0.3800 8.6322 1.7421 0.0790 0.2268 2.0123 1.9525 0.2231 6.1066 5.8385 0.1104 1.8859 3.9017 1.7158 21.3391 5.3666 3.4959 4.1965 16.4986 2.9280 0.7156 2.6511 2.3266 0.3241 2.9655 5.2540 0.6204 19.0476 18.9451 33.1425 3.3951 50.9125 88.6826 3.0631 21.2205 8.1292 27.6437 50.9930 6.8480 0.6532 135.9193 38.5025 9.4504 3.5333 1.5595 6.4481 32.2391 67.7733 222.9684 7.9104 10.2156 162.4376 3.4885 16.3467 9.5001 7.9918 49.0815 14.2541 41.9094 43.5533 165.7974 1.1318 1.1347 11.4931 16.1060 3.3572 0.7145 8.8965 13.5114 10.5377 13.1648 1.5508 16.3340 10.8256 2.3299 32.1686 93.0803 5.4400 11.3101 12.7433 14.2339 12.5064 9.8345 93.7527 18.5054 13.4054 115.2646 29.1695 37.2324 28.7092 18.7430 12.1862 31.5093 123.0689 0.8546 3.4448 10.6130 24.2815 2.4517 6.8807 27.4813 60.4372 46.1195 39.1958 65.2558 30.7445 3.0754 2.9685 2.8796
temp: 298.150 k
press: 1.00000 atm
elementType: 16 8 8 8 8 7 6 6 6 6 6 6 6 6 6 6 6 6 6 6 6 6 6 1 1 1 1 1 1 1 1 1 1 1 1 1 1 1 1 1 1 1 1 1
symmnumber: 1
zpe: 911445.3 jmol-1
zpe.correction: 0.347151 hartree
zpe.thermalcorrener: 0.372222 hartree
zpe.thermalcorrenthalpy: 0.373166 hartree
zpe.thermalcorrgfe: 0.284221 hartree
zpe.sumelectzpe: -1412.335931 hartree
zpe.sumelectthermal: -1412.310861 hartree
zpe.sumelectthermalent: -1412.309917 hartree
zpe.sumelectthermalfe: -1412.398862 hartree
dipole: -6.0258 -0.1857 -0.3270
dipole: 6.0375
quadrupole: -174.8704 -142.5703 -139.6378
quadrupole: 11.4188 -0.5984 -2.5085
quadrupole: -22.5109 9.7892 12.7217 11.4188 -0.5984 -2.5085
hfenergy: -1412.6830827 hartree
pointgroup: C01[X(C17H21N1O4S1)]
dipole: 2.3639003 0.1352774 0.1895272 debye
polarizability: 274.1031509|0.2797339|198.7469078|27.4532003|24.2498348|192.612612 unknown
InChI: InChI=1S/C17H21NO4S/c1-4-5-16(23-9-18)17(19)20-8-12-6-14-15(22-10-21-14)7-13(12)11(2)3/h6-7,11,16H,4-5,8,10H2,1-3H3
charge 0 multiplicity 1
44 atoms
S  -4.704695 -0.689593 -0.862444
O  -1.053384 0.957654 -1.199059
O  4.379712 -0.439597 1.863874
O  3.703723 1.841401 1.524008
O  -2.014324 -1.059928 -1.896641
N  -6.836879 0.743326 0.576519
C  1.107164 -2.314765 -1.500943
C  1.714326 -1.133421 -0.729345
C  1.321921 0.227015 -0.934369
C  2.751248 -1.423159 0.211848
C  0.255606 0.641432 -1.920139
C  3.333493 -0.371609 0.913109
C  1.945252 1.291641 -0.204469
C  2.936194 0.967212 0.713301
C  0.597199 -3.43408 -0.554237
C  2.129961 -2.884629 -2.522668
C  -2.90635 0.434503 1.131083
C  -3.230101 0.473937 -0.379994
C  -2.394099 -0.923153 1.658632
C  4.550337 0.952802 2.364879
C  -2.062221 0.012281 -1.250371
C  -2.170375 -0.891393 3.18552
C  -5.945706 0.183741 -0.000085
H  0.223073 -1.966199 -2.061605
H  3.084194 -2.450437 0.379109
H  0.495249 1.608312 -2.38891
H  0.03793 -0.111157 -2.692502
H  1.642484 2.330357 -0.365384
H  1.418733 -3.893133 0.026419
H  0.116861 -4.234838 -1.145283
H  -0.150588 -3.043579 0.159311
H  2.469614 -2.106898 -3.230912
H  1.674017 -3.707028 -3.104031
H  3.024129 -3.285513 -2.009468
H  -2.141206 1.216506 1.310463
H  -3.813842 0.740111 1.687212
H  -3.53921 1.48888 -0.680028
H  -1.443599 -1.184695 1.152177
H  -3.121177 -1.717284 1.401254
H  5.605459 1.247186 2.249052
H  4.19888 1.00267 3.41153
H  -1.429054 -0.119318 3.464956
H  -1.798803 -1.864656 3.553149
H  -3.111845 -0.665707 3.720279
