program: Gaussian 09
title: 000250909
version: EM64L-G09RevD.01
frameworkgroup: C1[X(C7H5Cl2N3S)]
method: RPBEPBE
basis: SDD
operation: Freq
keyword: #p
keyword: freq=noraman
keyword: PBEPBE/SDD
title: #p freq=noraman PBEPBE/SDD
converged: NO NO NO NO
title: Mulliken charges:
elementType: Cl Cl S N N N C C C C C C C H H H H H
charge: 0.005208 -0.011657 0.259633 -0.208569 0.011416 0.112867 0.253704 -0.236126 -0.135640 -0.207452 -0.237991 -0.219413 -0.798541 0.293864 0.283492 0.292599 0.292503 0.250104
chargesum: 0.00000
title: Mulliken charges with hydrogens summed into heavy atoms:
elementType: Cl Cl S N N N C C C C C C C
charge: 0.005208 -0.011657 0.259633 -0.208569 0.011416 0.112867 0.253704 -0.236126 0.158224 0.076040 -0.237991 -0.219413 0.036665
polarizability: 2.13398681e+02 -1.45432435e+00 1.56510426e+02 1.07904475e-04 8.94994460e-03 5.17359980e+01
1716.lowfreq: 0.0021 0.0027 0.0032 0.5217 6.0941 8.2226 55.1248 77.2494 101.7094
frequency: 55.0886 77.2473 101.7084 118.9592 131.7800 152.7340 172.2681 248.2277 267.7303 298.0087 320.6374 364.2917 396.4800 446.0370 535.3924 545.5129 617.5139 632.8028 649.9807 657.6011 706.8160 736.6214 758.5836 819.1461 848.1749 898.1954 944.5131 987.1080 1003.0428 1065.4915 1115.7646 1195.9438 1241.9367 1261.0383 1279.6185 1349.7837 1368.6222 1434.0707 1435.2990 1449.6271 1461.8118 1490.0643 1587.9317 3031.1552 3158.1475 3167.7761 3217.2507 3268.6101
redmass: 3.8299 8.2454 1.2442 6.0683 3.4628 11.4039 11.6379 4.9925 6.8535 10.4333 20.6329 7.8644 13.3960 8.4556 8.5482 6.5760 4.0072 8.4745 5.3535 7.5784 1.9290 4.5622 7.9614 5.8740 1.3830 9.0162 6.1569 1.1766 1.3038 3.0381 2.1405 3.5052 3.2715 4.2718 4.4024 1.1874 7.0605 5.2704 1.0513 1.2538 4.0733 9.1724 9.5874 1.0281 1.1045 1.1063 1.0948 1.1007
irintensity: 1.9142 0.0821 0.0629 0.9794 2.0712 1.1303 0.6239 2.7022 9.3129 0.1375 0.6351 0.2324 8.8101 9.6150 6.6852 1.6691 6.5995 9.2895 3.9930 6.3508 31.0604 12.5199 53.1989 45.7972 30.3885 20.0180 4.6738 6.9430 1.0679 40.1114 90.0362 100.9119 17.0225 350.0495 0.4271 25.8078 163.9187 40.8733 16.4423 67.6027 86.0902 126.9130 129.4900 12.6936 4.3427 5.7469 4.5723 7.7025
temp: 298.150 k
press: 1.00000 atm
elementType: 17 17 16 7 7 7 6 6 6 6 6 6 6 1 1 1 1 1
symmnumber: 1
zpe: 293516.6 jmol-1
zpe.correction: 0.111795 hartree
zpe.thermalcorrener: 0.123998 hartree
zpe.thermalcorrenthalpy: 0.124943 hartree
zpe.thermalcorrgfe: 0.071753 hartree
zpe.sumelectzpe: -1751.232111 hartree
zpe.sumelectthermal: -1751.219908 hartree
zpe.sumelectthermalent: -1751.218963 hartree
zpe.sumelectthermalfe: -1751.272153 hartree
dipole: 2.3100 3.5476 -0.0020
dipole: 4.2334
quadrupole: -103.7844 -89.8208 -97.5651
quadrupole: 2.2829 -0.0048 -0.0036
quadrupole: -6.7276 7.2360 -0.5084 2.2829 -0.0048 -0.0036
hfenergy: -1751.3439059 hartree
pointgroup: C01 [X(C7H5Cl2N3S1)]
dipole: -0.8997046 1.3891609 -0.1865322 debye
dipolederiv: -0.9046544 -0.0234436 -0.10863 -0.0516891 -0.0729313 -0.0041319 -0.1071512 -0.0005739 -0.0424725 -0.6986142 -0.42953 -0.0583824 -0.3796607 -0.3833196 -0.0300107 -0.0611435 -0.0363512 -0.0575923 -0.0739791 0.0617406 -0.0053721 0.3495119 -0.6433894 0.0751713 -0.0206241 0.0391427 -0.063252 -0.3277422 0.4271009 -0.0760087 0.8951897 -0.7794441 0.1592335 -0.1012793 0.1005034 0.0768123 -0.9996278 -0.1632812 -0.090964 -0.0709235 -0.4821653 0.0059565 -0.095719 -0.0056171 -0.2172247 -0.5422989 -0.4397851 -0.0292644 -0.1764873 -1.2656797 0.0390265 -0.0434395 0.0060488 -0.1282002 0.68899 0.011532 0.0766349 -0.4984819 0.4621004 -0.0833465 0.103944 -0.0193178 0.0879104 0.4958623 -0.0232271 0.0624498 -0.4896562 1.6052414 -0.1470071 0.0873286 -0.0884758 0.0271518 -0.5781167 -0.0241835 -0.0503275 -0.0609451 -0.1500552 -0.0084868 -0.0481179 -0.0038355 -0.1736613 -0.4152722 -0.2154851 -0.0278346 0.0067614 -0.2395228 0.0081807 -0.0399051 -0.0197531 -0.1062041 1.7051285 0.1142369 0.2111979 0.0504078 0.5423102 -0.0243168 0.2146721 -0.0162967 0.0007181 1.1433527 0.6658182 0.1112757 0.5511395 1.1161031 0.0082637 0.1175594 0.02274 -0.0099941 0.2305883 -0.1178649 0.029139 -0.0773792 0.0682019 -0.0103831 0.0270601 -0.0156046 0.0553961 0.1293952 0.0362762 -0.0160617 0.0183472 0.0582001 0.0121267 -0.0151078 0.0143142 0.2392343 0.1114384 0.0172154 -0.0101824 -0.0113093 0.0517555 0.0057394 -0.0086557 0.0092854 0.1834774 -0.021858 0.0298029 0.0428397 -0.0625009 0.1045646 0.0608922 0.0254552 0.0553645 0.0001799 -0.0045728 0.0392801 -0.0495525 -0.0465533 0.0910844 -0.0847987 -0.0228126 -0.0570248 -0.0044045 0.0619807 0.0337974 -0.0109567 0.0542291 -0.0830542 0.017891 -0.0120637 0.0154516 0.1321255 unknown
polarizability: 210.9002484|2.4214771|156.2311155|19.8578391|-5.2979041|54.5137417 unknown
InChI: InChI=1S/C7H5Cl2N3S/c1-13-7-11-4(8)2-6-10-5(9)3-12(6)7/h2-3H,1H3
charge 0 multiplicity 1
18 atoms
Cl 4.466151 -0.083546 0.437178
Cl -3.175734 -2.171415 -0.41091
S  -0.790581 2.71968 -0.373205
N  0.572151 0.3625 -0.075058
N  2.038889 -1.388331 0.202827
N  -1.771918 0.141441 -0.358153
C  0.733754 -1.072951 0.022359
C  -0.695863 0.912873 -0.264195
C  1.848147 0.926635 0.054596
C  -0.431202 -1.88207 -0.080673
C  2.697364 -0.174543 0.220151
C  -1.639896 -1.217003 -0.268522
C  -2.645167 2.90943 -0.615058
H  2.041248 1.993195 0.021833
H  -0.348279 -2.966296 -0.012048
H  -3.172399 2.484295 0.249246
H  -2.949285 2.393408 -1.535382
H  -2.815681 3.994198 -0.691587
