program: Gaussian 09
title: 000250924
version: EM64L-G09RevD.01
frameworkgroup: C1[X(C15H19N3O)]
method: RPBEPBE
basis: SDD
operation: Freq
keyword: #p
keyword: freq=noraman
keyword: PBEPBE/SDD
title: #p freq=noraman PBEPBE/SDD
converged: YES YES NO NO
title: Mulliken charges:
elementType: O N N N C C C C C C C C C C C C C C C H H H H H H H H H H H H H H H H H H H
charge: -0.451361 -0.104377 -0.024138 -0.015782 -0.552772 0.377312 -0.390343 -0.360818 -0.586602 0.123771 0.337114 0.388126 -0.410175 -0.412303 -0.616514 -0.819431 -0.810924 -0.157960 -0.154998 0.207367 0.258333 0.223273 0.273164 0.214376 0.232309 0.241474 0.277228 0.246466 0.259424 0.246554 0.225397 0.226293 0.226552 0.232009 0.230836 0.229531 0.230291 0.361300
chargesum: 0.00000
title: Mulliken charges with hydrogens summed into heavy atoms:
elementType: O N N N C C C C C C C C C C C C C C C
charge: -0.090061 -0.104377 -0.024138 -0.015782 -0.087073 0.377312 0.106095 0.085867 -0.345129 0.123771 0.337114 0.388126 0.113519 0.093674 -0.391117 -0.134577 -0.120266 -0.157960 -0.154998
polarizability: 2.30016109e+02 1.32623430e+01 1.68370474e+02 -1.09775767e+01 1.98730747e+01 1.45916033e+02
1716.lowfreq: -7.6642 -0.0010 -0.0010 -0.0009 2.5394 6.0402 18.8139 19.0015 33.5393
frequency: 18.1572 18.8510 33.4131 34.7594 57.7436 62.8509 77.2454 106.2583 110.2907 125.2104 146.4415 147.9753 180.3118 196.5123 223.7063 258.5669 288.5011 304.6294 325.9878 343.2640 347.4122 360.2450 372.7349 379.3534 400.4711 422.0850 445.8454 467.2120 513.9676 521.5944 532.2883 568.9344 626.4240 683.6230 720.7761 743.9208 758.5518 770.4128 821.0744 833.0019 839.9892 898.0481 932.7097 936.1385 959.1469 997.9526 999.8076 1004.8543 1012.5732 1025.7743 1028.4086 1035.3131 1051.6952 1068.1765 1119.8879 1131.7712 1136.9565 1189.8018 1199.2721 1221.3377 1231.7517 1259.7455 1269.3798 1274.3035 1282.1422 1289.1687 1306.1752 1327.6020 1352.4062 1367.4569 1379.6532 1387.1027 1395.3961 1402.8599 1409.1633 1443.2907 1446.5000 1461.0032 1471.1497 1472.3744 1474.7224 1476.6343 1479.7197 1489.0567 1508.7483 1602.2702 1628.2251 2191.5578 2196.0012 2904.8330 2938.3656 2968.9163 2972.4085 2981.0192 3002.6009 3009.9383 3022.7814 3039.8126 3039.9204 3046.5787 3048.7568 3069.5540 3074.9318 3082.0108 3086.1539 3103.9778 3115.9589 3586.2968
redmass: 5.4204 5.9294 6.2435 5.4065 2.7206 2.7984 3.6207 1.0795 5.0534 3.2976 2.1051 2.0265 3.9516 2.7822 3.3084 3.2505 2.5596 2.7105 3.4276 2.8994 1.4053 2.9026 3.6411 3.5767 4.3729 2.9726 3.6388 4.3009 5.0032 5.8079 2.9061 4.8753 4.1889 4.0979 4.0900 4.2045 1.2240 1.2422 3.5807 3.8480 1.4715 1.4610 4.7434 4.3263 1.8403 1.7146 3.5259 1.8304 1.6801 2.5841 1.4822 2.6772 1.6177 4.1370 1.8866 1.8173 1.7432 1.3990 1.3401 1.7497 1.6238 1.3557 1.3332 1.3529 1.5349 1.8004 1.7170 1.3327 1.2210 1.4332 1.9564 1.8886 1.2858 3.1895 1.3046 1.0825 1.0867 1.0465 1.0816 1.1638 1.0539 1.1410 1.1379 1.0916 2.6911 6.5228 6.8441 12.4148 12.4228 1.0702 1.0660 1.0378 1.0381 1.0596 1.0591 1.0593 1.0939 1.0971 1.1020 1.0969 1.0937 1.1003 1.1030 1.0983 1.0982 1.0909 1.0911 1.0661
irintensity: 0.6205 0.3569 2.0660 2.2770 6.8302 2.5564 2.5402 0.0151 8.7901 0.5835 4.1583 1.1285 1.8192 0.9689 1.5238 4.5752 0.2473 0.1861 6.9572 26.8223 75.7579 17.5357 0.3294 10.3445 4.9954 11.0950 6.7657 3.6379 10.2131 10.5590 7.1959 0.9225 1.4407 13.5886 1.6971 0.8803 8.1748 11.7437 0.5949 3.2078 22.6878 13.3950 2.1806 8.1713 4.6770 29.8206 1.9261 10.3534 16.6220 19.2463 23.5580 18.8204 0.0292 88.1068 24.4289 73.7461 82.7301 24.4415 7.2081 6.6537 16.7673 13.2488 4.9103 8.3284 22.9388 15.2899 1.2622 37.8289 12.0534 21.2943 3.5535 11.3185 9.4013 29.0979 21.6970 1.7830 11.6295 0.1399 4.4372 43.6005 27.1046 13.2340 3.1198 29.8696 29.4217 8.6824 21.9642 18.0314 19.3213 72.6978 55.2492 49.9764 23.9468 27.2182 8.8734 9.2863 23.5640 32.0695 8.7691 7.5639 8.8143 18.8958 15.6741 28.1344 9.3240 25.4997 11.0287 33.7859
temp: 298.150 k
press: 1.00000 atm
elementType: 8 7 7 7 6 6 6 6 6 6 6 6 6 6 6 6 6 6 6 1 1 1 1 1 1 1 1 1 1 1 1 1 1 1 1 1 1 1
symmnumber: 1
zpe: 810533.4 jmol-1
zpe.correction: 0.308716 hartree
zpe.thermalcorrener: 0.329660 hartree
zpe.thermalcorrenthalpy: 0.330604 hartree
zpe.thermalcorrgfe: 0.255834 hartree
zpe.sumelectzpe: -821.015867 hartree
zpe.sumelectthermal: -820.994923 hartree
zpe.sumelectthermalent: -820.993979 hartree
zpe.sumelectthermalfe: -821.068749 hartree
dipole: 5.4308 -2.7465 1.1026
dipole: 6.1849
quadrupole: -134.7027 -137.4931 -109.2805
quadrupole: -13.5387 3.1786 12.7109
quadrupole: -7.5439 -10.3344 17.8783 -13.5387 3.1786 12.7109
hfenergy: -821.3245833 hartree
pointgroup: C01 [X(C15H19N3O1)]
dipole: 2.2890949 -0.8172481 -0.1148095 debye
polarizability: 223.4371157|28.1633576|151.2013129|-3.0794512|19.4030146|169.6641871 unknown
InChI: InChI=1S/C15H19N3O/c1-12-9-14(15(19)10-13(12)2)11-18(7-3-5-16)8-4-6-17/h9-10,19H,3-4,7-8,11H2,1-2H3
charge 0 multiplicity 1
38 atoms
O  1.282714 -0.279426 2.714279
N  -1.580639 -0.147041 0.345589
N  -0.40841 4.580399 1.153098
N  -5.698787 -2.271834 -1.34433
C  -0.591583 -1.19075 0.748767
C  0.841029 -0.814815 0.399198
C  -1.389029 1.164401 1.004137
C  -2.965227 -0.642395 0.243364
C  1.311676 -0.890917 -0.933739
C  1.756401 -0.375148 1.385944
C  2.63425 -0.558381 -1.307577
C  3.541771 -0.12369 -0.291979
C  -0.836274 2.21924 -0.008548
C  -3.208315 -1.34722 -1.128818
C  3.086989 -0.03835 1.043411
C  3.079056 -0.66767 -2.755033
C  4.974522 0.241906 -0.633106
C  -0.596318 3.530655 0.615931
C  -4.579229 -1.866396 -1.259954
H  -0.854825 -2.121126 0.211245
H  -0.661712 -1.40634 1.837542
H  -2.344381 1.535684 1.421909
H  -0.682907 1.07317 1.85099
H  -3.2302 -1.351251 1.062474
H  -3.659652 0.212431 0.319684
H  0.607185 -1.220025 -1.708368
H  0.106691 1.836091 -0.438413
H  -1.551084 2.336022 -0.844115
H  -3.004847 -0.625386 -1.940877
H  -2.496929 -2.185088 -1.254656
H  3.781344 0.299814 1.824849
H  3.426705 0.305395 -3.152907
H  3.921702 -1.37641 -2.872256
H  2.255486 -1.017991 -3.400047
H  5.533832 0.565558 0.260822
H  5.515181 -0.615207 -1.078668
H  5.017388 1.06282 -1.374184
H  2.00002 0.02877 3.321144
