program: Gaussian 09
title: 000250921
version: EM64L-G09RevD.01
frameworkgroup: C1[X(C13H14ClN3O)]
method: RPBEPBE
basis: SDD
operation: Freq
keyword: #p
keyword: freq=noraman
keyword: PBEPBE/SDD
title: #p freq=noraman PBEPBE/SDD
converged: YES YES NO NO
title: Mulliken charges:
elementType: Cl O N N N C C C C C C C C C C C C C H H H H H H H H H H H H H H
charge: -0.065552 -0.432614 -0.266545 -0.001492 0.001460 -0.510815 -0.348249 -0.350650 0.346529 -0.425368 -0.423525 0.095050 -0.399600 -0.329169 -0.113540 -0.199949 -0.148162 -0.151731 0.246233 0.243720 0.245104 0.268034 0.243474 0.239089 0.285503 0.246081 0.268851 0.261477 0.260519 0.257047 0.258116 0.400673
chargesum: 0.00000
title: Mulliken charges with hydrogens summed into heavy atoms:
elementType: Cl O N N N C C C C C C C C C C C C C
charge: -0.065552 -0.031941 -0.266545 -0.001492 0.001460 -0.020861 0.164889 0.131913 0.346529 0.106216 0.106803 0.095050 -0.139081 -0.072122 -0.113540 0.058167 -0.148162 -0.151731
polarizability: 2.23628565e+02 -8.85147727e+00 1.37244724e+02 1.71683818e+00 4.18534431e+00 1.41440683e+02
1716.lowfreq: -5.6563 -3.3315 -0.0012 0.0016 0.0017 5.2290 27.5048 36.4508 42.3544
frequency: 27.4346 36.4407 42.2877 48.8328 66.5268 76.8347 128.3272 137.0030 143.9077 153.9887 171.8068 216.3315 259.7311 269.5340 315.4394 330.9289 357.3485 367.1338 372.0432 385.2774 410.3464 428.8617 459.6607 473.8274 526.0505 536.0626 547.2261 623.6672 654.2577 719.8582 748.8749 766.8191 777.6901 823.3184 838.5565 876.3941 878.4553 941.8951 944.2123 948.0769 968.8377 992.4392 1022.6305 1035.5259 1053.4782 1074.7605 1084.9823 1106.2349 1112.8686 1124.5375 1182.9166 1213.3394 1227.4019 1239.6679 1246.3604 1266.9512 1280.2158 1286.6024 1298.4257 1311.1815 1349.6763 1353.6007 1367.1353 1377.7337 1409.4411 1448.7559 1454.9425 1458.9797 1467.7792 1477.1499 1482.5776 1509.9577 1589.3418 1628.4683 2204.5563 2204.6754 2554.3563 2951.5500 2960.1290 2969.6595 2996.2498 3005.6026 3014.7681 3049.4209 3053.0503 3073.8278 3077.5681 3143.8459 3159.9801 3179.6775
redmass: 10.9793 9.6231 7.0603 7.4154 2.5309 2.8888 7.9150 4.1469 5.8620 4.9729 7.6236 3.2152 3.4068 3.4100 3.1612 7.1558 8.9082 4.2598 3.7945 4.2318 4.7817 3.5789 4.1340 3.5160 4.5866 4.6285 4.2108 7.3711 5.7135 3.6619 3.4237 1.3991 1.2583 1.4758 3.5227 3.8597 1.6920 3.7053 4.4728 1.4026 2.3178 2.5066 2.7348 2.7449 2.4493 1.9757 1.3649 1.8355 2.0862 1.6145 2.1145 1.2679 1.3865 1.3706 2.5846 1.2850 1.2166 1.1674 1.3231 1.2599 1.5563 3.3762 1.2948 1.3888 3.4785 1.1057 1.1015 1.2532 1.7602 1.1936 1.0837 1.7098 4.2896 3.9572 12.4418 12.4443 1.0697 1.0625 1.0678 1.0668 1.0590 1.0590 1.0989 1.0986 1.0967 1.0997 1.0998 1.0925 1.0886 1.0975
irintensity: 0.5584 3.5505 3.7131 7.5074 1.6606 4.6651 5.3346 5.7988 1.2713 4.1701 2.5997 2.2469 0.6768 2.5936 2.6593 0.7558 0.4079 4.5819 0.5019 12.4207 4.1135 2.4931 12.8074 7.9493 9.8332 10.2731 2.0728 23.6843 39.2586 1.2245 8.3731 2.2913 9.1477 50.6168 16.5362 27.1242 15.1757 7.6226 2.7129 0.5050 35.4394 19.3282 11.0774 5.3114 2.9576 15.4154 26.3064 28.8288 21.3067 73.6875 44.1580 6.5396 8.4138 21.4536 83.7414 12.6701 0.1741 0.2469 6.2678 12.2327 3.9364 13.2484 10.4714 20.9551 33.5040 16.0366 2.6171 33.0892 147.6685 17.6688 9.3206 62.6992 8.3049 51.8675 13.5707 7.2304 1294.3696 18.5699 20.8273 37.6214 8.4090 6.8837 20.3431 0.4785 2.0399 15.0582 16.9198 2.6278 1.8459 3.2283
temp: 298.150 k
press: 1.00000 atm
elementType: 17 8 7 7 7 6 6 6 6 6 6 6 6 6 6 6 6 6 1 1 1 1 1 1 1 1 1 1 1 1 1 1
symmnumber: 1
zpe: 645595.2 jmol-1
zpe.correction: 0.245894 hartree
zpe.thermalcorrener: 0.263845 hartree
zpe.thermalcorrenthalpy: 0.264789 hartree
zpe.thermalcorrgfe: 0.197492 hartree
zpe.sumelectzpe: -1201.961114 hartree
zpe.sumelectthermal: -1201.943164 hartree
zpe.sumelectthermalent: -1201.942220 hartree
zpe.sumelectthermalfe: -1202.009517 hartree
dipole: -0.0205 -1.7790 -0.5890
dipole: 1.8740
quadrupole: -144.1399 -146.0317 -110.5265
quadrupole: 6.5516 -1.6645 3.9468
quadrupole: -10.5739 -12.4657 23.0395 6.5516 -1.6645 3.9468
hfenergy: -1202.2070086 hartree
pointgroup: C01[X(C13H14Cl1N3O1)]
dipole: -0.0634906 -0.6878689 0.2577285 debye
polarizability: 223.4995644|3.3224311|136.0725448|8.8167941|-3.7657545|142.7418633 unknown
InChI: InChI=1S/C13H14ClN3O/c14-12-3-4-13(18)11(9-12)10-17(7-1-5-15)8-2-6-16/h3-4,9,18H,1-2,7-8,10H2
charge 0 multiplicity 1
32 atoms
Cl 5.2292 -0.886789 1.545766
O  0.283086 -0.406238 -1.867354
N  -1.113034 -0.019494 0.288185
N  -1.23535 4.913299 0.0959
N  -5.331619 -2.562492 -0.023404
C  -0.081194 -0.893713 0.962964
C  -0.929786 1.427245 0.624551
C  -2.50554 -0.505406 0.515434
C  1.298443 -0.719233 0.34243
C  -1.410348 2.332526 -0.544381
C  -2.876807 -1.634859 -0.487514
C  1.420844 -0.535065 -1.07144
C  2.467046 -0.815674 1.131124
C  2.700373 -0.476085 -1.671971
C  3.729067 -0.75432 0.512408
C  3.862577 -0.591695 -0.88125
C  -1.31637 3.760094 -0.198326
C  -4.231085 -2.155189 -0.237642
H  -0.415594 -1.94102 0.826406
H  -0.052668 -0.700543 2.056476
H  -1.463378 1.690561 1.56138
H  0.146394 1.603666 0.790729
H  -2.635938 -0.867563 1.557338
H  -3.204752 0.33678 0.375717
H  -0.795494 2.129606 -1.441433
H  -2.460953 2.106052 -0.809818
H  -2.818213 -1.250686 -1.522894
H  -2.15707 -2.471689 -0.41748
H  2.392882 -0.948596 2.215897
H  2.768813 -0.339807 -2.754999
H  4.85363 -0.547863 -1.341898
H  -0.505762 -0.253207 -1.190999
