program: Gaussian 09
title: 000250893
version: EM64L-G09RevD.01
frameworkgroup: C1[X(C11H13N5)]
method: RPBEPBE
basis: SDD
operation: Freq
keyword: #pfreq=noraman
keyword: PBEPBE/SDD
title: #p freq=noraman PBEPBE/SDD
converged: NO YES NO NO
title: Mulliken charges:
elementType: N N N N N C C C C C C C C C C C H H H H H H H H H H H H H
charge: -0.148252 -0.210766 -0.030206 -0.113918 -0.109585 0.416514 -0.351567 -0.335437 0.454228 -0.405044 -0.386422 -0.645003 -0.645363 -0.319022 -0.141349 -0.158765 0.241642 0.241844 0.221531 0.267799 0.239566 0.221859 0.239666 0.221390 0.240902 0.240608 0.207391 0.263625 0.282136
chargesum: 0.00000
title: Mulliken charges with hydrogens summed into heavy atoms:
elementType: N N N N N C C C C C C C C C C C
charge: -0.148252 -0.210766 -0.030206 -0.113918 -0.109585 0.416514 -0.109925 -0.093594 0.454228 -0.183513 -0.118624 0.056088 0.057536 -0.111631 0.122276 0.123371
polarizability: 3.68941534e+02 2.46351695e+00 1.45716781e+02 1.06879363e-03 6.70135071e-02 7.09072940e+01
1716.lowfreq: -5.8664 -0.0008 -0.0006 0.0006 8.1682 8.6806 17.3068 39.3925 65.2976
frequency: 17.2140 39.3451 65.2969 70.7744 99.4813 129.5931 157.5688 179.7184 199.4980 219.0807 246.1112 299.0941 312.7850 399.8169 408.2909 429.6938 455.6069 503.9111 527.2172 536.3699 627.2554 632.5397 643.3750 691.2272 738.0290 742.1956 754.1280 797.2631 807.0206 830.8996 861.9833 886.3136 900.2253 933.9475 941.0639 963.6315 983.6937 995.0354 1023.6928 1054.6814 1104.3847 1111.6220 1112.1011 1136.2809 1166.0235 1166.3867 1198.8646 1237.8979 1245.6814 1256.5649 1276.3050 1324.4341 1356.4621 1370.8288 1381.1135 1400.4918 1428.2670 1429.8676 1452.6137 1459.9513 1465.5112 1478.1942 1492.2908 1506.4117 1533.0628 1544.7386 1581.0858 1634.4722 2949.7320 2957.0191 3018.7691 3021.1594 3022.7877 3102.7809 3113.0672 3118.2556 3150.2646 3171.3414 3174.9263 3257.3329 3266.2301
redmass: 3.7994 5.3224 5.6661 2.2999 6.2738 1.7665 1.9835 5.8894 1.1634 4.3037 2.2851 4.2033 4.7612 4.7411 3.5245 3.1457 4.3048 4.4083 2.2871 3.9395 2.5776 7.1938 6.7271 5.6697 1.4763 2.9639 6.4706 1.5360 1.3212 1.6493 4.9048 6.9960 8.0397 1.3908 3.0869 1.4889 1.3598 2.9051 3.4583 1.5124 1.2370 1.3292 2.2983 1.4792 1.6902 1.3773 1.1753 4.0869 4.1223 2.8678 2.0174 1.5351 2.4111 3.2059 4.6220 3.0790 3.3501 1.2322 2.4698 1.3678 1.0402 1.0456 1.1179 1.1261 2.9877 6.1005 5.3515 6.2141 1.0367 1.0390 1.1001 1.0880 1.1024 1.0968 1.0948 1.0896 1.0876 1.0939 1.0946 1.0971 1.1021
irintensity: 0.0023 0.0272 1.5248 0.0391 6.1276 3.4886 1.1846 2.5720 0.0135 0.8953 0.7833 2.3590 27.7580 0.1078 1.3330 0.0729 7.8891 23.4165 15.5285 13.6225 34.2640 1.8881 1.0615 13.7209 5.4741 3.3675 1.9133 38.5406 12.5675 60.9422 4.4678 1.7149 0.5587 13.0322 31.3816 16.0564 2.6870 0.0356 172.9111 26.0432 0.0172 1.0685 125.0269 13.1231 5.3444 12.7447 122.7082 2.2418 9.2119 25.4639 23.6809 8.2672 18.0468 203.8290 36.4603 4.5783 155.6813 22.2604 30.5635 2.0458 0.0318 24.3233 3.5228 60.9974 323.0663 10.2683 128.6584 469.4225 91.4513 133.4862 13.9111 32.8148 62.4756 4.1413 42.7225 10.5178 2.2401 18.1340 13.4149 0.4363 0.5099
temp: 298.150 k
press: 1.00000 atm
elementType: 7 7 7 7 7 6 6 6 6 6 6 6 6 6 6 6 1 1 1 1 1 1 1 1 1 1 1 1 1
symmnumber: 1
zpe: 599809.1 jmol-1
zpe.correction: 0.228455 hartree
zpe.thermalcorrener: 0.243283 hartree
zpe.thermalcorrenthalpy: 0.244227 hartree
zpe.thermalcorrgfe: 0.184534 hartree
zpe.sumelectzpe: -699.490639 hartree
zpe.sumelectthermal: -699.475811 hartree
zpe.sumelectthermalent: -699.474867 hartree
zpe.sumelectthermalfe: -699.534559 hartree
dipole: -12.4156 -0.7688 -0.0012
dipole: 12.4394
quadrupole: -121.0998 -82.4210 -98.9809
quadrupole: -2.0459 -0.0116 -0.0037
quadrupole: -20.2659 18.4129 1.8530 -2.0459 -0.0116 -0.0037
hfenergy: -699.7190939 hartree
pointgroup: C01 [X(C11H13N5)]
dipole: 4.8860672 0.2755313 0.0428888 debye
polarizability: 368.9490744|1.2225953|145.55341|1.9463101|3.2771111|71.063125 unknown
InChI: InChI=1S/C11H13N5/c1-15(2)11-5-3-10(4-6-11)7-14-16-8-12-13-9-16/h3-9H,1-2H3
charge 0 multiplicity 1
29 atoms
N  4.549172 -0.19808 0.014251
N  -3.351308 -0.172487 -0.033197
N  -1.973776 -0.466223 -0.036943
N  -5.412682 0.744347 -0.008383
N  -5.549515 -0.688869 -0.068739
C  3.168237 -0.021687 0.013744
C  2.585004 1.287815 0.068387
C  2.275401 -1.148175 -0.040881
C  0.310841 0.334144 0.011892
C  1.19281 1.450534 0.066743
C  0.888948 -0.969337 -0.04155
C  5.441636 0.968922 0.07738
C  5.124154 -1.550787 -0.045315
C  -1.129235 0.551052 0.011535
C  -4.093019 1.017527 0.013456
C  -4.302461 -1.192317 -0.084438
H  3.221093 2.175527 0.111308
H  2.676042 -2.164575 -0.082487
H  0.776144 2.465246 0.108926
H  0.220118 -1.835031 -0.083549
H  5.297939 1.641902 -0.791427
H  6.488889 0.629997 0.073576
H  5.27772 1.559763 1.000766
H  6.222764 -1.481266 -0.042679
H  4.819131 -2.085094 -0.966868
H  4.819824 -2.165291 0.825383
H  -1.460768 1.604565 0.053989
H  -3.673395 2.017318 0.059482
H  -4.028007 -2.241539 -0.128065
