program: Gaussian 09
title: 000250978
version: EM64L-G09RevD.01
frameworkgroup: C1[X(C16F30N2O)]
method: RPBEPBE
basis: SDD
operation: Freq
keyword: #p
keyword: freq=noraman
keyword: PBEPBE/SDD
title: #p freq=noraman PBEPBE/SDD
converged: YES YES NO NO
title: Mulliken charges:
elementType: F F F F F F F F F F F F F F F F F F F F F F F F F F F F F F O N N C C C C C C C C C C C C C C C C
charge: -0.134747 -0.111466 -0.116504 -0.133347 -0.120779 -0.118641 -0.124626 -0.110418 -0.115656 -0.117604 -0.117541 -0.122508 -0.114709 -0.119722 -0.120077 -0.116103 -0.115635 -0.120222 -0.122431 -0.120037 -0.122545 -0.120102 -0.122112 -0.121548 -0.121118 -0.126450 -0.118394 -0.121944 -0.126144 -0.119861 -0.152194 -0.019441 0.071631 0.226568 0.238176 0.251841 0.247135 0.265457 0.259043 0.255099 0.255873 0.165832 0.179722 0.207890 0.207857 0.182811 0.020502 0.374776 0.374413
chargesum: 0.00000
title: Mulliken charges with hydrogens summed into heavy atoms:
polarizability: 2.43292052e+02 -1.29786669e+00 1.85062015e+02 5.67401316e+00 -9.02297164e+00 1.83754413e+02
1716.lowfreq: -3.8337 -1.5393 -0.0009 -0.0003 0.0001 2.3656 7.1609 11.7322 13.3059
frequency: 7.0527 11.7109 13.2661 20.0555 26.4383 32.7436 34.1508 39.7063 47.4013 48.5913 55.8806 63.1046 69.3562 72.9643 92.0660 98.0729 100.6479 112.4662 116.6559 125.7333 128.0255 129.4625 131.7765 142.8776 148.0715 166.8322 169.3261 181.1949 192.1994 197.4621 209.8007 210.6582 213.8616 227.4115 230.5940 236.5084 244.2349 245.9489 247.8778 250.0109 251.0954 267.9025 271.7250 276.7301 277.4039 285.3807 288.0987 288.5630 290.2386 299.2913 299.8532 303.3035 304.8452 314.3148 316.9121 318.0372 323.5132 328.8112 330.5068 333.6637 343.4370 380.5357 381.8347 395.4871 409.0363 410.0520 420.6712 422.5580 437.1753 445.6896 458.4109 463.0662 465.2917 498.3559 513.8114 513.9071 547.7164 551.3385 554.2689 555.1709 566.8871 567.7116 577.3328 581.9920 587.4820 588.4376 589.9569 591.2590 654.3882 654.7696 681.5941 733.2052 799.5460 804.2456 813.8892 846.1628 850.4016 886.2517 892.7943 909.3840 929.8922 953.1858 966.7229 976.0723 978.7954 981.7702 999.1486 1008.4349 1009.9424 1024.5093 1027.8771 1030.3744 1032.3754 1035.9684 1036.8444 1047.0550 1047.9725 1050.2815 1052.3742 1055.2165 1077.2199 1078.0563 1083.2388 1085.7507 1086.0218 1110.6971 1111.7588 1119.1665 1128.3599 1132.7805 1133.1724 1141.2840 1142.9637 1154.4869 1155.7660 1188.7399 1188.8778 1203.0596 1288.1902 1417.3010 1530.1778
redmass: 17.7201 17.4190 17.8301 17.5362 17.5225 17.7617 18.2267 17.7709 17.9721 18.0094 16.2548 17.3880 17.3251 18.0015 17.1801 17.4010 17.8736 18.5604 18.1031 18.1309 18.2184 17.9371 17.9537 17.3666 17.5203 17.8447 17.9123 16.3649 17.6836 17.5449 18.1520 17.1806 17.9089 18.0338 17.9230 18.3137 18.4258 18.3965 18.4747 18.3230 18.2020 18.2031 18.3108 18.2244 18.3210 18.4308 18.4108 18.6255 18.6466 18.7266 18.7463 18.6588 18.7264 17.7272 18.6043 18.4167 17.1502 18.2106 18.6964 17.2752 17.2023 17.3360 16.8558 16.7577 17.3746 17.6057 17.7389 17.7389 17.3645 17.3289 17.3178 17.7907 17.4663 15.7388 17.6263 17.6304 16.5292 16.8022 16.9758 16.9439 17.0538 16.8407 17.3634 17.1420 17.5847 17.5595 17.6347 17.4919 17.2216 17.2390 13.6949 13.0791 13.5883 13.2983 14.2894 13.4538 13.5020 13.8367 13.7420 14.1744 13.9282 13.5896 13.7437 13.7267 13.4156 13.5235 13.3990 13.3610 13.3767 13.0894 13.1230 12.8243 12.9658 13.2420 13.1520 13.1402 13.0515 13.0814 12.9248 12.8862 13.2421 13.2639 13.1125 13.1664 13.1603 12.8581 12.8041 12.5572 12.5261 12.3246 12.3625 12.1826 12.1661 12.0811 12.0716 12.3405 12.3417 12.4079 12.5529 12.2661 12.4017
irintensity: 0.0089 0.0149 0.0005 0.0056 0.0105 0.0122 0.0095 0.1342 0.0959 0.0195 0.1581 0.3246 0.1565 0.0472 0.2154 0.6315 0.3870 0.0504 0.0728 1.3266 0.9609 1.2492 1.6334 0.0447 0.2193 0.4346 1.5914 8.4729 35.1491 2.3816 8.6151 4.8175 3.1864 0.3655 0.7801 0.2454 1.7094 0.0724 0.1316 0.1012 0.1322 2.9091 0.4912 0.8397 0.8933 0.9315 0.3031 0.8552 0.3954 0.0255 0.0063 0.1867 0.0696 0.8174 0.2489 0.7299 3.9781 0.0142 0.4043 1.3005 1.3168 0.2638 2.6167 4.4345 8.6862 7.5055 8.8010 0.6649 0.8084 0.1029 7.1944 3.3871 8.7270 5.0841 2.0963 1.7326 1.1502 10.4005 8.6604 13.2497 4.2564 10.4950 12.7757 9.9429 1.8123 0.4861 0.4796 1.9136 27.9177 57.0870 3.1678 20.7924 393.8345 239.4417 57.3672 4.2860 5.5309 28.4586 81.0408 100.2346 82.6369 133.8248 44.2618 3.2866 19.8780 8.5586 129.5438 130.3244 270.4248 100.0754 11.6013 26.5359 10.9169 29.0039 159.3628 74.5810 76.1303 91.0454 60.4504 33.8753 465.7789 136.6774 166.8737 124.4608 386.4102 31.8786 2.5628 87.4497 15.0294 39.5781 41.7460 10.7529 9.7588 0.3016 0.3096 14.5792 78.7312 65.1337 0.1518 4.8936 9.6253
temp: 298.150 k
press: 1.00000 atm
elementType: 9 9 9 9 9 9 9 9 9 9 9 9 9 9 9 9 9 9 9 9 9 9 9 9 9 9 9 9 9 9 8 7 7 6 6 6 6 6 6 6 6 6 6 6 6 6 6 6 6
symmnumber: 1
zpe: 473779.7 jmol-1
zpe.correction: 0.180453 hartree
zpe.thermalcorrener: 0.228260 hartree
zpe.thermalcorrenthalpy: 0.229204 hartree
zpe.thermalcorrgfe: 0.094307 hartree
zpe.sumelectzpe: -3785.757549 hartree
zpe.sumelectthermal: -3785.709743 hartree
zpe.sumelectthermalent: -3785.708798 hartree
zpe.sumelectthermalfe: -3785.843695 hartree
dipole: 0.8966 -0.0688 0.1278
dipole: 0.9082
quadrupole: -281.8091 -276.0236 -282.9241
quadrupole: 0.8737 -0.6362 3.0843
quadrupole: -1.5568 4.2286 -2.6718 0.8737 -0.6362 3.0843
hfenergy: -3785.9380023 hartree
pointgroup: C01 [X(C16F30N2O1)]
dipole: -0.3525246 0.0244837 0.0530133 debye
polarizability: 243.214123|-0.7914184|185.0951079|-6.2120772|8.9815643|183.7992499 unknown
InChI: InChI=1S/C16F30N2O/c17-3(18,5(21,22)7(25,26)9(29,30)11(33,34)13(37,38)15(41,42)43)1-47-2(49-48-1)4(19,20)6(23,24)8(27,28)10(31,32)12(35,36)14(39,40)16(44,45)46
charge 0 multiplicity 1
49 atoms
F  -1.507045 0.177825 -0.556802
F  -2.831447 1.622019 0.625483
F  3.379394 0.912277 -1.852505
F  1.465721 0.206109 -0.819557
F  -3.774326 0.8969 -1.824023
F  -3.600921 -1.32471 -1.328633
F  2.96656 1.910385 0.636099
F  2.737257 -0.171732 1.540735
F  -1.337627 0.063258 2.174572
F  -3.546799 -0.470552 2.380648
F  4.523025 -1.618104 -1.530714
F  2.547098 -1.478449 -2.667083
F  -6.123339 -0.448276 -1.477045
F  -5.541063 -1.108701 0.626727
F  5.37605 -0.78742 0.932737
F  5.000586 1.035531 2.250755
F  -1.762355 -2.553293 2.702645
F  -3.184477 -2.807482 0.93538
F  2.931909 -3.808467 -1.322928
F  3.19558 -2.738966 0.676118
F  -5.473301 1.514682 1.51461
F  -7.421459 0.824964 0.540422
F  6.086507 0.813103 -1.211771
F  7.237581 1.159757 0.730541
F  -6.593553 2.272141 -1.875957
F  -4.891036 3.140262 -0.644715
F  -7.033054 3.417796 0.031478
F  5.558784 3.538043 1.157826
F  4.792788 3.238282 -0.96169
F  7.011415 3.467218 -0.582252
O  -1.086785 -3.018183 -0.737095
N  0.419491 -2.184324 0.755642
N  0.226345 -3.197378 -1.335629
C  -2.695989 0.278609 0.225093
C  2.879233 0.041145 -0.860123
C  -3.875084 -0.051203 -0.776144
C  3.403907 0.563884 0.537934
C  -2.427171 -0.56877 1.531262
C  3.136073 -1.428471 -1.377209
C  -5.389414 -0.076637 -0.326659
C  4.9369 0.556103 0.921493
C  -2.046329 -2.099087 1.38952
C  2.548484 -2.661054 -0.578889
C  -6.086225 1.205412 0.279847
C  5.999671 1.371526 0.082367
C  -0.860078 -2.404633 0.507057
C  1.048254 -2.677797 -0.390969
C  -6.145957 2.526437 -0.576809
C  5.826322 2.930121 -0.071893
