program: Gaussian 09
title: 000250916
version: EM64L-G09RevD.01
frameworkgroup: C1[X(C26H18Cl4N4O2S)]
method: RPBEPBE
basis: SDD
operation: Freq
keyword: #p
keyword: freq=noraman
keyword: PBEPBE/SDD
title: #p freq=noraman PBEPBE/SDD
converged: YES YES NO NO
title: Mulliken charges:
elementType: Cl Cl Cl Cl S O O N N N N C C C C C C C C C C C C C C C C C C C C C C C C C C H H H H H H H H H H H H H H H H H H
charge: -0.011852 -0.011853 -0.001358 -0.001359 0.868043 -0.539551 -0.539544 -0.435686 -0.435686 0.012886 0.012885 -0.103859 -0.103864 -0.205840 -0.205832 -0.210118 -0.210115 0.501302 0.501304 -0.351202 -0.351205 -0.412597 -0.412600 0.500576 0.500575 -0.403588 -0.403587 -0.344076 -0.344074 -0.395929 -0.395929 -0.068883 -0.068881 -0.198441 -0.198442 -0.103335 -0.103336 0.274892 0.274881 0.280061 0.280068 0.276564 0.276563 0.230507 0.230507 0.280858 0.280859 0.212598 0.212598 0.287645 0.287645 0.233847 0.233848 0.260554 0.260554
chargesum: 0.00000
title: Mulliken charges with hydrogens summed into heavy atoms:
elementType: Cl Cl Cl Cl S O O N N N N C C C C C C C C C C C C C C C C C C C C C C C C C C
charge: -0.011852 -0.011853 -0.001358 -0.001359 0.868043 -0.539551 -0.539544 -0.154827 -0.154827 0.012886 0.012885 -0.103859 -0.103864 0.069051 0.069049 0.069943 0.069953 0.501302 0.501304 -0.074638 -0.074641 -0.182091 -0.182093 0.500576 0.500575 -0.190991 -0.190989 -0.056431 -0.056429 -0.162082 -0.162082 -0.068883 -0.068881 0.062114 0.062112 -0.103335 -0.103336
polarizability: 8.00404513e+02 1.40694727e-02 3.55038959e+02 4.36839291e+01 4.33781532e-02 3.99792842e+02
1716.lowfreq: -2.6092 0.0016 0.0019 0.0021 1.0288 1.4347 3.8084 8.4806 11.6658
frequency: 3.8049 8.4464 11.6607 19.6651 20.3870 29.3302 30.1762 46.4305 54.0696 58.4789 73.3888 90.0481 102.5358 114.8878 130.0228 147.5096 153.4236 158.0027 171.9680 173.3081 180.0563 189.3542 191.0643 203.6268 212.8337 248.6920 253.9725 256.7113 257.8999 274.9601 292.9696 313.2565 316.0373 329.9578 357.8083 358.1379 364.8973 386.3714 403.8409 413.7018 414.9324 415.6946 431.9311 435.0924 441.9480 442.2980 442.5839 457.9240 486.3369 525.9235 530.7762 558.8983 571.0854 578.1328 578.1933 610.2274 610.5915 618.7105 620.5974 650.0402 655.4495 661.5845 661.7881 701.5227 702.9306 703.8567 703.8924 727.5200 727.8382 780.1020 815.0346 815.0539 825.5739 828.0597 831.2225 832.9554 852.2685 855.6053 898.0959 898.1038 919.3508 921.0673 921.3035 921.4312 922.0931 952.6219 952.6356 958.6835 961.0915 981.1482 983.4193 984.8983 987.3618 1000.6906 1000.7102 1049.4832 1055.8710 1095.0065 1096.3571 1113.1936 1113.7919 1125.3695 1127.3008 1149.3147 1149.4724 1171.6455 1176.5265 1221.3026 1221.3607 1254.0081 1254.0872 1279.0653 1280.9720 1287.1793 1288.4434 1328.3963 1329.4785 1366.7210 1367.1321 1395.7888 1395.7940 1397.2006 1399.6300 1414.2195 1415.4668 1457.8654 1457.8733 1475.1930 1477.7863 1530.6979 1530.7215 1547.8887 1548.6219 1577.9285 1578.3172 1594.8084 1594.8732 1600.6802 1601.4840 1605.8159 1606.8023 2985.6496 2985.6704 3126.5324 3126.6489 3136.9431 3136.9478 3153.7466 3154.1452 3160.3960 3160.8634 3171.0550 3171.0594 3175.6384 3175.6421 3191.0783 3191.1303 3393.0324 3393.0363
redmass: 15.2379 10.1721 7.9667 9.9896 12.6187 12.2090 9.2398 4.0044 4.2117 7.9303 8.3376 10.9434 9.2713 6.9734 6.6682 8.8796 7.5861 5.6000 12.0076 6.3351 12.7581 16.3707 11.1415 4.0501 4.5312 5.2571 4.0465 11.2619 6.2711 8.2315 7.3949 7.7114 6.7142 6.4832 5.1954 5.0662 8.6858 7.5531 7.9778 4.2897 4.7319 2.9982 9.0492 6.1231 3.7340 3.1524 4.3649 7.7507 7.2055 3.0910 2.7849 6.6443 6.8064 3.9043 3.9211 1.3476 1.3472 7.0646 7.1758 6.8166 6.9728 7.1841 7.1114 6.6188 6.0132 3.3444 3.4704 3.4587 3.4219 14.7985 1.3465 1.3464 1.3891 1.3936 4.9642 4.1051 1.4818 1.5971 1.4064 1.4064 6.8625 4.3274 1.5708 1.5703 6.9940 1.4065 1.4067 1.3652 1.3629 1.3828 1.3654 4.5077 4.1919 4.8642 4.8596 2.5334 2.6018 2.6382 3.1733 1.8852 1.9585 1.9060 1.6763 1.4949 1.5049 1.1315 1.1236 1.8924 1.8894 1.3937 1.3891 2.0137 1.7108 1.6636 1.4514 1.9785 1.9514 4.3511 4.1823 4.2316 4.3527 3.3708 3.4353 4.3145 4.2995 2.8284 2.8124 2.3248 2.2735 2.1552 2.2575 7.9254 7.7693 6.3489 6.3752 6.7844 6.7242 5.6336 6.2966 5.0630 4.8069 1.0870 1.0870 1.0895 1.0894 1.0896 1.0896 1.0905 1.0904 1.0951 1.0950 1.0953 1.0953 1.0927 1.0927 1.0944 1.0944 1.0747 1.0747
irintensity: 0.3064 1.4990 1.7710 0.1380 0.0334 1.8363 0.4970 0.3184 0.4121 0.0461 0.1210 1.9799 0.2144 2.0820 0.0064 1.8294 1.2866 0.1033 1.4428 3.0415 0.2913 2.2273 0.2343 14.9441 16.5313 0.3009 20.6141 1.1991 23.4660 5.6826 39.3919 10.1139 18.5850 1.9391 1.7897 3.3910 0.6572 3.4403 8.3227 4.6175 6.5455 0.0756 27.8224 1.9133 2.3549 12.3235 34.1950 5.9677 153.8855 155.5827 80.6602 0.3292 51.1283 1.2568 0.1097 41.8563 88.6705 2.1096 11.7606 9.8533 121.6207 0.0347 12.2809 3.8647 55.0635 7.0321 0.9583 1.2340 13.5072 156.5310 15.5318 31.8207 26.5282 20.0028 10.9690 0.3565 18.8958 62.6490 0.0190 0.0480 8.8153 2.4866 35.1867 72.5689 70.1136 3.0972 6.0662 5.2040 0.0334 0.0393 0.8681 4.0999 5.4835 39.5354 17.0236 116.3144 20.4112 75.4824 300.3798 17.5470 121.4332 23.8172 83.9180 75.3996 13.7929 84.9551 5.7274 20.8821 0.1014 11.0957 1.8953 521.6960 118.3053 39.5158 32.2006 6.3100 58.8911 1.0836 24.7976 8.1461 38.4800 14.4998 105.8363 0.0102 18.8948 147.1600 22.7775 267.1601 55.3290 280.4313 72.7850 288.0758 51.6233 327.8564 95.7631 2.5671 3.6673 66.4675 331.5961 110.9828 131.0270 0.2064 110.7095 26.2626 2.0325 5.1864 12.1244 0.2078 0.9751 7.9973 3.8181 6.8202 2.9700 1.5613 0.9093 4.8743 0.8336 1.4148 0.1926
temp: 298.150 k
press: 1.00000 atm
elementType: 17 17 17 17 16 8 8 7 7 7 7 6 6 6 6 6 6 6 6 6 6 6 6 6 6 6 6 6 6 6 6 6 6 6 6 6 6 1 1 1 1 1 1 1 1 1 1 1 1 1 1 1 1 1 1
symmnumber: 1
zpe: 997498.5 jmol-1
zpe.correction: 0.379927 hartree
zpe.thermalcorrener: 0.414449 hartree
zpe.thermalcorrenthalpy: 0.415393 hartree
zpe.thermalcorrgfe: 0.305154 hartree
zpe.sumelectzpe: -3606.522124 hartree
zpe.sumelectthermal: -3606.487602 hartree
zpe.sumelectthermalent: -3606.486658 hartree
zpe.sumelectthermalfe: -3606.596896 hartree
dipole: -0.0012 -7.1789 0.0016
dipole: 7.1789
quadrupole: -272.4647 -299.7247 -211.0946
quadrupole: -0.0225 -71.3915 0.0201
quadrupole: -11.3700 -38.6300 50.0001 -0.0225 -71.3915 0.0201
hfenergy: -3606.9020507 hartree
pointgroup: C01 [X(C26H18Cl4N4O2S1)]
dipole: 0.0019021 2.8243782 0.0012545 debye
polarizability: 793.9493888|-0.3401266|355.0391838|-66.7271205|0.0669727|406.2477411 unknown
InChI: InChI=1S/C26H18Cl4N4O2S/c27-23-11-1-17(13-25(23)29)15-31-33-19-3-7-21(8-4-19)37(35,36)22-9-5-20(6-10-22)34-32-16-18-2-12-24(28)26(30)14-18/h1-16,33-34H
charge 0 multiplicity 1
55 atoms
Cl 8.640551 1.463052 -3.042105
Cl -8.636174 1.475458 3.044131
Cl 10.967734 3.302429 -1.62322
Cl -10.96051 3.3198 1.627038
S  -0.002571 -3.814233 -0.001702
O  0.573835 -4.587788 -1.327968
O  -0.580183 -4.588221 1.323786
N  4.489581 -0.26137 2.030752
N  -4.489288 -0.252604 -2.030799
N  5.4732 0.215461 1.20808
N  -5.472072 0.225116 -1.207647
C  1.377534 -2.681998 0.607761
C  -1.380906 -2.679253 -0.61006
C  2.366565 -2.270114 -0.302173
C  -2.369237 -2.266607 0.30029
C  1.407071 -2.347531 1.971714
C  -1.409984 -2.343545 -1.973716
C  3.457549 -1.076404 1.532492
C  -3.458468 -1.069628 -1.533288
C  3.41476 -1.45401 0.161276
C  -3.416187 -1.448475 -0.162397
C  2.456483 -1.53278 2.435836
C  -2.458153 -1.526765 -2.437078
C  7.501551 1.514104 0.904383
C  -7.498135 1.527012 -0.902625
C  6.423328 0.967767 1.731803
C  -6.421092 0.979303 -1.730676
C  7.563267 1.266789 -0.496444
C  -7.559913 1.27892 0.49806
C  8.514464 2.312445 1.504456
C  -8.509795 2.327523 -1.501921
C  8.607332 1.804811 -1.26295
C  -8.60283 1.818284 1.265184
C  9.561115 2.849225 0.729904
C  -9.555304 2.865639 -0.726752
C  9.611349 2.597786 -0.657014
C  -9.605616 2.613401 0.660019
H  2.329317 -2.606744 -1.343556
H  -2.33245 -2.604193 1.34138
H  0.643139 -2.740883 2.650342
H  -0.646683 -2.737486 -2.652713
H  4.204789 -1.111184 -0.509797
H  -4.205647 -1.105005 0.509015
H  2.50347 -1.257844 3.49662
H  -2.504762 -1.250829 -3.497619
H  4.490699 -0.033779 3.03593
H  -4.490161 -0.024224 -3.035798
H  6.446844 1.216873 2.811436
H  -6.444314 1.229333 -2.810101
H  6.789563 0.654822 -0.967393
H  -6.787168 0.665287 0.968416
H  8.486057 2.515018 2.581174
H  -8.481315 2.530735 -2.578516
H  10.341078 3.461913 1.190812
H  -10.334307 3.479995 -1.187062
