program: Gaussian 09
title: 000250878
version: EM64L-G09RevD.01
frameworkgroup: C1[X(C9H13N2O2P)]
method: RPBEPBE
basis: SDD
operation: Freq
keyword: #p
keyword: freq=noraman
keyword: PBEPBE/SDD
title: #p freq=noraman PBEPBE/SDD
converged: YES YES NO NO
title: Mulliken charges:
elementType: P O O N N C C C C C C C C C H H H H H H H H H H H H H
charge: 1.338663 -0.465905 -0.570873 -0.724562 -0.864832 -0.362216 -0.368291 -0.293005 0.541887 -0.421102 -0.341965 -0.195272 -0.218719 -0.262791 0.230629 0.206087 0.222067 0.235777 0.238190 0.218093 0.345642 0.344338 0.217271 0.273922 0.223350 0.225845 0.227772
chargesum: 0.00000
title: Mulliken charges with hydrogens summed into heavy atoms:
elementType: P O O N N C C C C C C C C C
charge: 1.338663 -0.465905 -0.570873 -0.378920 -0.520494 0.074501 0.089553 0.163278 0.541887 -0.203832 -0.068043 0.028078 0.007126 -0.035019
polarizability: 1.76570433e+02 -7.20212851e+00 1.09190638e+02 8.75512961e+00 1.08852653e+01 1.18542372e+02
1716.lowfreq: -24.4933 -12.8050 -8.7445 0.0011 0.0018 0.0022 23.4275 34.7644 82.8636
frequency: 21.8689 34.5686 82.7967 111.8306 136.5999 191.7289 242.6013 255.1073 273.0710 305.7924 318.0403 372.8157 400.0887 407.6223 416.0139 440.1695 500.8637 537.4022 550.5815 585.0725 603.3292 619.1140 691.7161 752.1528 762.5712 772.2765 814.4054 825.5550 871.8722 877.5298 893.1869 900.9758 944.0674 960.3350 982.6084 983.5393 1027.0611 1036.6407 1067.1534 1087.8726 1090.2293 1111.0105 1170.5627 1189.1456 1194.0158 1217.3762 1247.7832 1264.7813 1314.1843 1343.5209 1348.8896 1357.6896 1360.6587 1368.7959 1401.6975 1438.6394 1454.7954 1464.1750 1468.4423 1488.1695 1595.3239 1617.0237 2982.9928 2985.0702 2993.5007 3057.8409 3068.9300 3090.5827 3113.6970 3130.6555 3141.0282 3155.1417 3168.6089 3539.6581 3559.9819
redmass: 4.0171 4.5240 3.5147 4.7151 3.3301 4.5510 3.4560 4.9761 6.6712 4.6673 1.8245 2.1567 3.6036 4.0678 4.9230 3.6286 1.8078 1.6765 1.8965 6.2966 5.8286 5.8502 1.8437 4.1595 1.9614 3.9036 3.1110 1.2626 1.8312 3.8738 1.5400 2.7852 2.4646 1.3715 1.3370 5.6660 2.1399 2.6589 8.3763 2.0757 1.8244 2.5072 1.0493 1.1758 1.1146 1.2648 1.8196 1.1914 1.8044 1.2958 1.2544 1.2642 1.7033 1.2639 3.1794 1.0925 1.0818 2.0722 1.0872 2.4397 5.9223 6.0951 1.0655 1.0653 1.0618 1.0984 1.1014 1.1012 1.0874 1.0864 1.0928 1.0950 1.1013 1.0756 1.0767
irintensity: 1.4468 2.0954 1.2906 0.2571 3.5358 2.2683 2.0950 8.6859 3.5328 1.8947 6.0415 94.6918 15.6886 26.5627 15.6482 62.1729 51.7829 3.1380 26.2913 11.0318 40.9853 65.8850 40.8921 36.9872 82.4509 110.7590 34.4878 0.3280 16.9498 150.3612 25.0923 44.8676 17.8829 0.2450 0.6232 2.1797 19.0345 71.3499 88.1421 47.5313 20.8058 59.7664 0.9366 15.0102 4.1286 8.2053 36.7856 4.8990 122.1672 3.5891 0.0666 10.7899 49.1834 46.4897 25.8252 11.6424 5.7814 9.0613 9.7254 149.5453 5.8540 125.4655 32.0076 35.4430 34.2336 25.8397 43.2260 25.5318 12.9457 0.0704 30.0737 20.1752 15.2055 27.4031 41.4606
temp: 298.150 k
press: 1.00000 atm
elementType: 15 8 8 7 7 6 6 6 6 6 6 6 6 6 1 1 1 1 1 1 1 1 1 1 1 1 1
symmnumber: 1
zpe: 563161.2 jmol-1
zpe.correction: 0.214497 hartree
zpe.thermalcorrener: 0.227947 hartree
zpe.thermalcorrenthalpy: 0.228891 hartree
zpe.thermalcorrgfe: 0.173300 hartree
zpe.sumelectzpe: -950.865061 hartree
zpe.sumelectthermal: -950.851611 hartree
zpe.sumelectthermalent: -950.850667 hartree
zpe.sumelectthermalfe: -950.906258 hartree
dipole: -2.3512 -5.6141 -1.7657
dipole: 6.3375
quadrupole: -74.4316 -100.9866 -85.3314
quadrupole: 6.0431 3.6328 0.5503
quadrupole: 12.4849 -14.0701 1.5852 6.0431 3.6328 0.5503
hfenergy: -951.0795578 hartree
pointgroup: C01 [X(C9H13N2O2P1)]
dipole: -1.0072403 -2.268795 0.2342741 debye
polarizability: 174.8209033|-5.1513467|119.3103727|15.1120333|10.0247579|110.1721668 unknown
InChI: InChI=1S/C9H13N2O2P/c12-14(10-7-4-8-13-14)11-9-5-2-1-3-6-9/h1-3,5-6,10-11H,4,7-8H2
charge 0 multiplicity 1
27 atoms
P  -1.359991 0.862535 -0.754978
O  -1.579253 0.86678 0.985177
O  -1.249485 2.337096 -1.325385
N  -2.671467 -0.089241 -1.375989
N  -0.053356 -0.276122 -0.98922
C  -3.349183 -0.914934 0.922042
C  -3.171799 -1.246697 -0.58226
C  -2.036597 -0.428586 1.570375
C  1.255356 -0.22383 -0.43772
C  2.211696 -1.18847 -0.856528
C  1.626055 0.755537 0.522755
C  3.515256 -1.175764 -0.317618
C  2.933439 0.755275 1.052433
C  3.886498 -0.205728 0.641833
H  -4.125404 -0.137128 1.047159
H  -3.68958 -1.824077 1.456083
H  -2.464638 -2.093167 -0.688395
H  -4.130899 -1.567607 -1.024764
H  -2.170964 -0.200665 2.639904
H  -1.232352 -1.183673 1.455939
H  -3.348122 0.421687 -1.946951
H  -0.198942 -0.921034 -1.770156
H  1.933916 -1.944198 -1.602397
H  0.90121 1.506412 0.853134
H  4.241906 -1.92533 -0.651334
H  3.207975 1.517557 1.790294
H  4.899524 -0.195931 1.057168
