program: Gaussian 09
title: 000250874
version: EM64L-G09RevD.01
frameworkgroup: C1[X(C15H26N2O)]
method: RPBEPBE
basis: SDD
operation: Freq
keyword: #p
keyword: freq=noraman
keyword: PBEPBE/SDD
title: #p freq=noraman PBEPBE/SDD
converged: NO YES NO NO
title: Mulliken charges:
elementType: O N N C C C C C C C C C C C C C C C H H H H H H H H H H H H H H H H H H H H H H H H H H
charge: -0.463456 -0.072337 -0.085928 -0.109292 -0.113114 0.008986 -0.005338 -0.536982 -0.277514 -0.466112 -0.450106 -0.452975 -0.390994 -0.364700 -0.431089 -0.426253 -0.383534 -0.391893 0.225599 0.197822 0.198735 0.172858 0.255651 0.211963 0.244491 0.175823 0.223113 0.189846 0.228603 0.192801 0.210206 0.203773 0.181120 0.205092 0.165101 0.189740 0.214869 0.189790 0.212586 0.206602 0.187907 0.204156 0.188648 0.335737
chargesum: 0.00000
title: Mulliken charges with hydrogens summed into heavy atoms:
elementType: O N N C C C C C C C C C C C C C C C
charge: -0.127718 -0.072337 -0.085928 0.116307 0.084708 0.207721 0.167520 -0.069368 -0.033023 -0.067177 -0.031658 -0.049967 -0.006100 0.005492 -0.026480 -0.023877 0.010975 0.000911
polarizability: 1.81265705e+02 1.68196447e+00 1.62481038e+02 -1.49533801e-01 -2.45989799e+00 1.57230918e+02
1716.lowfreq: -25.4344 -17.5705 -0.0004 0.0002 0.0005 14.7061 46.4878 71.7356 82.3023
frequency: 46.4262 71.6493 82.2895 129.9377 141.7560 196.8524 222.4856 259.8998 270.9836 279.4304 289.5591 301.7790 320.3474 331.1371 341.1039 365.4247 403.5315 414.0112 428.0393 455.9790 462.8974 494.6405 505.2643 544.7105 571.6627 637.8948 689.5536 698.8090 727.0738 794.3939 807.7933 822.5192 828.0012 840.5168 854.3975 863.9673 879.8785 885.0681 912.2680 922.7181 939.6037 955.4545 975.0277 979.7439 1007.6540 1024.0898 1028.2400 1055.0971 1065.1509 1068.1361 1078.3358 1087.2611 1101.6165 1107.8908 1116.5649 1125.7408 1133.8815 1139.2772 1156.9495 1167.3909 1173.0192 1181.5281 1194.6680 1200.9259 1239.4872 1246.8872 1258.1926 1265.2152 1267.4059 1273.1613 1276.9041 1290.1558 1304.4678 1307.8097 1324.9081 1328.7147 1332.3595 1336.1080 1338.7774 1342.1128 1343.5587 1344.3446 1347.9810 1349.7717 1356.2380 1358.6110 1364.7179 1373.1589 1393.7043 1397.0862 1449.4791 1450.3268 1457.8923 1461.1036 1462.4255 1465.4615 1466.2858 1471.9978 1473.6259 1484.9019 2750.3296 2788.5714 2805.8843 2819.4324 2837.1448 2962.1482 2964.5667 2976.8384 2978.4839 2981.1218 2982.1124 2984.2950 2984.4150 2992.3442 3001.5822 3007.3860 3012.1333 3028.2414 3028.9730 3030.5764 3042.6521 3046.9601 3052.3786 3055.7925 3062.9201 3565.2395
redmass: 3.7787 2.8582 2.9784 3.4831 4.4475 2.5587 2.5535 2.2812 3.1510 1.5697 2.1675 2.3183 2.0332 2.5135 2.2217 2.4283 2.7523 4.2326 3.2054 2.9188 2.9680 2.3761 2.2241 2.3313 2.4072 3.9620 4.1029 4.5385 3.4115 2.7448 2.3652 1.9088 2.4894 1.9383 1.9236 2.5828 1.9056 2.1644 1.7436 2.2063 1.8855 1.7777 2.0829 2.4127 1.8296 1.8593 2.0757 1.7163 1.7252 1.6891 1.3603 1.9670 1.9624 2.2193 2.0147 2.4937 2.4148 1.8429 1.2873 1.6120 1.3243 1.3957 1.7298 1.8055 1.2472 1.2670 1.4969 1.3378 1.2799 1.8263 1.4452 1.3615 1.4591 1.4677 1.4365 1.2804 1.3920 1.4069 1.3921 1.4670 1.4284 1.4283 1.3874 1.5195 1.4950 1.5141 1.5896 1.4102 1.4419 1.6925 1.0904 1.0918 1.0863 1.0887 1.0913 1.0960 1.0918 1.0902 1.0930 1.0901 1.0789 1.0718 1.0706 1.0802 1.0701 1.0623 1.0617 1.0689 1.0720 1.0621 1.0668 1.0709 1.0660 1.0764 1.0840 1.0856 1.0854 1.0915 1.0967 1.0905 1.1023 1.1027 1.1032 1.1020 1.0989 1.0663
irintensity: 0.1547 0.3452 1.4291 3.0290 2.6851 1.6780 13.7485 24.6428 6.7058 50.6973 8.8668 15.2823 7.5371 4.9316 5.6847 0.2885 3.0998 2.2300 0.9118 1.4021 1.6735 3.8931 1.8040 0.9492 5.6607 31.1479 25.2270 4.7639 23.3152 9.2409 40.6315 0.3856 31.8136 19.8404 11.0071 2.6327 26.5471 3.6219 1.7575 2.3491 0.4923 2.9260 17.1438 1.0917 16.2909 20.6686 5.0858 3.4633 17.5956 11.9146 34.4586 1.4178 10.4850 4.8317 4.3181 21.5202 23.0714 25.7983 13.8115 4.3473 3.1429 8.7078 5.8363 52.3607 11.5430 0.8653 0.5284 3.2123 6.8740 34.9758 36.8336 21.2298 0.0891 12.8122 3.3444 0.5439 7.1714 1.1704 1.7386 1.5520 3.6352 1.5456 10.4650 0.7990 13.3003 4.3221 18.5540 1.6223 3.6349 5.2904 5.9044 7.7620 22.7590 14.3966 4.5653 3.6143 12.1136 5.6240 0.7647 12.0799 67.8352 30.5210 268.7927 58.1306 114.6394 46.7434 44.0546 21.4694 17.4178 31.6525 25.2869 48.0650 27.1715 83.7966 67.5695 20.1776 102.5954 35.5738 66.6577 41.7916 27.3502 23.4806 93.4339 69.5287 27.1755 3.2877
temp: 298.150 k
press: 1.00000 atm
elementType: 8 7 7 6 6 6 6 6 6 6 6 6 6 6 6 6 6 6 1 1 1 1 1 1 1 1 1 1 1 1 1 1 1 1 1 1 1 1 1 1 1 1 1 1
symmnumber: 1
zpe: 1034218.1 jmol-1
zpe.correction: 0.393913 hartree
zpe.thermalcorrener: 0.409682 hartree
zpe.thermalcorrenthalpy: 0.410626 hartree
zpe.thermalcorrgfe: 0.352266 hartree
zpe.sumelectzpe: -770.472075 hartree
zpe.sumelectthermal: -770.456306 hartree
zpe.sumelectthermalent: -770.455361 hartree
zpe.sumelectthermalfe: -770.513722 hartree
dipole: -0.2121 -1.0654 -0.5981
dipole: 1.2401
quadrupole: -105.1294 -115.0878 -106.4562
quadrupole: 0.7979 2.8065 -4.0727
quadrupole: 3.7617 -6.1966 2.4350 0.7979 2.8065 -4.0727
hfenergy: -770.8659879 hartree
pointgroup: C01 [X(C15H26N2O1)]
dipole: -0.0972871 0.4246799 0.2195683 debye
polarizability: 181.3783187|-0.9031237|162.1555976|-0.170257|-2.6415639|157.4437449 unknown
InChI: InChI=1S/C15H26N2O/c18-15-12-9-11(13-5-2-4-8-17(13)15)10-16-7-3-1-6-14(12)16/h11-15,18H,1-10H2
charge 0 multiplicity 1
44 atoms
O  -1.252497 -2.888701 0.455409
N  -1.300878 -0.396347 0.553856
N  1.361683 0.754148 -0.526013
C  0.633527 -1.672415 -0.389952
C  -0.592394 -0.109311 -1.867534
C  -1.712868 0.06865 -0.80127
C  1.78929 -0.642646 -0.233309
C  -0.017364 -1.540307 -1.784074
C  -0.485579 -1.584075 0.665229
C  0.588075 0.884559 -1.781558
C  -2.213325 1.529422 -0.702908
C  2.467226 -0.698448 1.15607
C  -2.378495 -0.300726 1.562795
C  2.50484 1.697442 -0.503414
C  -3.363948 1.667284 0.31795
C  3.671685 0.265018 1.228764
C  -2.902597 1.142963 1.696106
C  3.217358 1.695419 0.862648
H  1.07986 -2.677469 -0.273963
H  -1.076312 0.046723 -2.853169
H  -2.575435 -0.557488 -1.153845
H  2.565811 -0.957207 -0.990929
H  -0.808101 -2.30195 -1.900785
H  0.736044 -1.698918 -2.580572
H  -0.081731 -1.622712 1.697033
H  1.237998 0.699498 -2.681731
H  0.236113 1.930772 -1.859206
H  -2.538852 1.868891 -1.706342
H  -1.369848 2.168117 -0.38084
H  2.783786 -1.739669 1.364045
H  1.728101 -0.406451 1.92658
H  -1.974261 -0.650349 2.534095
H  -3.243781 -0.964032 1.300892
H  2.120312 2.710412 -0.731259
H  3.253735 1.44194 -1.303789
H  -4.240763 1.07918 -0.025667
H  -3.691661 2.72171 0.392862
H  4.455706 -0.067106 0.516396
H  4.124258 0.245824 2.238651
H  -2.089182 1.786091 2.083236
H  -3.735769 1.169304 2.425188
H  2.514918 2.06848 1.632752
H  4.082249 2.386163 0.830195
H  -1.876533 -2.998186 1.217177
