program: Gaussian 09
title: 000250864
version: EM64L-G09RevD.01
frameworkgroup: C1[X(C14H16N2O)]
method: RPBEPBE
basis: SDD
operation: Freq
keyword: #p
keyword: freq=noraman
keyword: PBEPBE/SDD
title: #p freq=noraman PBEPBE/SDD
converged: YES YES NO NO
title: Mulliken charges:
elementType: O N N C C C C C C C C C C C C C C H H H H H H H H H H H H H H H H
charge: -0.447677 -0.066467 -0.044922 -0.354164 -0.502435 -0.486934 0.451364 0.206138 -0.439644 -0.387362 -0.369509 -0.221742 -0.226426 -0.243164 -0.173486 -0.363996 -0.188128 0.205826 0.255618 0.240042 0.225764 0.219083 0.225750 0.233241 0.263110 0.242239 0.224996 0.224884 0.363951 0.227453 0.237753 0.238201 0.230643
chargesum: 0.00000
title: Mulliken charges with hydrogens summed into heavy atoms:
elementType: O N N C C C C C C C C C C C C C C
charge: -0.083726 -0.066467 -0.044922 0.107279 -0.036630 -0.042101 0.451364 0.206138 -0.206402 -0.124252 -0.127269 0.003254 -0.001542 -0.015712 0.064267 -0.125794 0.042515
polarizability: 2.35493727e+02 7.18396015e+00 1.28548473e+02 1.27835945e+01 -2.24336626e+00 1.24984183e+02
1716.lowfreq: -4.0951 -0.0008 0.0002 0.0005 2.7401 10.3047 21.2755 23.3413 32.3076
frequency: 21.2494 22.8425 32.2454 51.1965 69.9129 85.2090 123.7455 197.5735 205.5377 231.7140 268.0084 287.3380 340.8062 380.4543 403.7773 406.0582 411.9085 458.1244 487.7981 514.3827 586.8356 615.9112 616.6005 638.8389 705.2292 731.4350 748.1860 754.6879 768.1621 800.5645 815.9978 831.9113 860.1220 899.1143 913.4344 953.4516 954.8872 965.9997 973.4077 982.4623 989.9957 998.3092 999.9207 1024.6151 1034.3790 1039.7386 1056.6849 1073.9625 1089.3866 1109.9823 1164.3484 1170.4501 1173.1843 1182.0609 1213.1384 1225.4820 1228.5060 1258.1152 1277.2539 1292.4857 1302.1401 1309.2795 1322.4918 1339.1690 1372.0163 1388.1636 1413.8327 1433.4912 1444.1259 1452.5611 1455.5219 1469.1614 1483.4454 1564.5060 1582.4269 1594.9231 1615.6501 2921.5971 2934.1180 3000.0298 3005.3517 3048.6690 3081.5728 3116.9836 3123.0398 3123.5204 3134.9604 3136.3663 3146.8494 3152.2326 3162.0457 3169.2057 3545.5791
redmass: 4.7379 4.2801 4.2204 3.8904 5.0157 4.3826 2.7879 4.5021 4.7146 3.6861 2.0436 1.6384 2.3211 3.0057 3.3992 2.8587 2.6670 3.3696 3.5941 3.3877 5.6868 6.4315 6.0145 4.6828 2.1803 2.8673 2.1963 1.5693 2.0385 1.4764 3.8167 3.6055 1.2480 1.3158 1.3947 1.8953 2.3184 3.3875 3.0143 1.3918 6.2027 1.3284 1.3415 2.2308 1.9424 2.4108 3.2386 1.8771 1.6926 1.7916 1.0727 1.0594 1.3102 1.1085 2.3089 1.3112 1.6415 1.2799 2.1776 1.2506 1.9122 1.5522 1.7427 1.4664 1.7979 3.5646 1.9403 1.3466 1.5574 1.2235 1.8927 1.1078 2.3423 5.7734 5.8800 6.1765 6.1546 1.0667 1.0622 1.0625 1.0963 1.0913 1.0997 1.0858 1.0883 1.0869 1.0887 1.0916 1.0960 1.0946 1.1015 1.1016 1.0677
irintensity: 0.9306 1.5880 0.6513 0.9759 0.1102 0.6010 0.7306 1.3203 2.7012 2.1090 85.2275 104.7761 1.5103 1.6195 5.7938 0.3832 18.4371 10.2472 11.9592 8.3568 0.6221 0.9140 0.7352 7.2127 29.3727 70.1333 18.3655 39.6147 26.5681 3.0232 4.6180 6.0666 0.3382 0.1543 6.1612 5.2683 5.5923 2.5078 21.4810 0.5154 0.2073 0.8683 0.1968 9.6513 10.4389 4.6335 2.7267 14.4658 2.7522 23.6503 1.9588 0.2638 7.6310 1.1134 1.0309 1.3872 4.8875 26.3569 8.2942 20.1477 1.4737 18.4575 0.4661 12.8774 2.8425 0.9722 18.4425 5.5432 7.6496 8.3284 52.0553 11.5120 15.7527 11.4645 61.9915 0.7389 6.5866 20.7567 68.7661 17.1044 16.5266 6.3713 18.0096 6.1588 16.8491 0.3459 5.3645 18.5577 37.1633 29.0542 26.0007 23.6575 12.5193
temp: 298.150 k
press: 1.00000 atm
elementType: 8 7 7 6 6 6 6 6 6 6 6 6 6 6 6 6 6 1 1 1 1 1 1 1 1 1 1 1 1 1 1 1 1
symmnumber: 1
zpe: 706180.4 jmol-1
zpe.correction: 0.268970 hartree
zpe.thermalcorrener: 0.284668 hartree
zpe.thermalcorrenthalpy: 0.285612 hartree
zpe.thermalcorrgfe: 0.222765 hartree
zpe.sumelectzpe: -726.516251 hartree
zpe.sumelectthermal: -726.500553 hartree
zpe.sumelectthermalent: -726.499608 hartree
zpe.sumelectthermalfe: -726.562456 hartree
dipole: -1.3336 0.6863 -0.1057
dipole: 1.5036
quadrupole: -77.6590 -101.7907 -96.4469
quadrupole: -2.1801 3.0278 2.2701
quadrupole: 14.3066 -9.8251 -4.4814 -2.1801 3.0278 2.2701
hfenergy: -726.7852208 hartree
pointgroup: C01 [X(C14H16N2O1)]
dipole: 0.5264039 0.2587423 -0.0766766 debye
polarizability: 235.3537154|-1.5348937|129.6447134|15.1062863|-0.0622948|124.0279536 unknown
InChI: InChI=1S/C14H16N2O/c17-16(12-13-6-2-1-3-7-13)11-9-14-8-4-5-10-15-14/h1-8,10,17H,9,11-12H2
charge 0 multiplicity 1
33 atoms
O  -0.858195 1.512609 -0.834927
N  -0.644942 0.181912 -0.131728
N  3.443249 -1.076706 0.458251
C  0.760719 0.229688 0.351679
C  1.754418 0.163599 -0.825471
C  -1.623601 0.161342 0.998035
C  -3.053693 -0.004273 0.50337
C  3.186716 0.005474 -0.348574
C  -4.108617 0.742838 1.080666
C  -3.354849 -0.935889 -0.5234
C  4.209057 0.916434 -0.718831
C  -5.443192 0.557967 0.650789
C  -4.685732 -1.117876 -0.9597
C  -5.736077 -0.373573 -0.371396
C  5.528032 0.706405 -0.257502
C  4.719591 -1.266569 0.89808
C  5.794692 -0.40909 0.568186
H  0.946688 1.142896 0.96199
H  0.91776 -0.656712 0.993133
H  1.648894 1.068056 -1.447749
H  1.479376 -0.711068 -1.44618
H  -1.535003 1.077248 1.622988
H  -1.33856 -0.706973 1.626532
H  -3.884451 1.476581 1.864881
H  -2.534055 -1.50489 -0.974957
H  3.967826 1.771963 -1.358307
H  -6.249596 1.143394 1.107062
H  -4.905815 -1.840963 -1.753646
H  -1.385975 1.247263 -1.633474
H  -6.769257 -0.51606 -0.707913
H  6.329993 1.398866 -0.535629
H  4.878083 -2.143534 1.537283
H  6.801219 -0.61126 0.947758
