program: Gaussian 09
title: 000250843
version: EM64L-G09RevD.01
frameworkgroup: C1[X(C6H9N3)]
method: RPBEPBE
basis: SDD
operation: Freq
keyword: #p
keyword: freq=noraman
keyword: PBEPBE/SDD
title: #p freq=noraman PBEPBE/SDD
converged: YES YES NO NO
title: Mulliken charges:
elementType: N N N C C C C C C H H H H H H H H H
charge: -0.351160 -0.070430 -0.546465 0.319211 0.020171 -0.316580 -0.808118 -0.192914 -0.337782 0.232958 0.226414 0.232832 0.225710 0.227557 0.316822 0.235481 0.285933 0.300359
chargesum: 0.00000
title: Mulliken charges with hydrogens summed into heavy atoms:
elementType: N N N C C C C C C
charge: -0.034337 -0.070430 0.039827 0.319211 0.020171 -0.083622 -0.123162 0.034643 -0.102301
polarizability: 1.19356090e+02 1.70206643e+00 8.98787607e+01 -2.53128871e+00 2.72404021e+00 4.60739132e+01
1716.lowfreq: -14.9908 -3.6759 -0.0006 0.0001 0.0004 4.4272 80.2518 151.7885 207.8521
frequency: 80.2398 151.7861 207.8340 234.2390 249.8076 325.8635 358.6637 438.0766 449.0568 541.1432 548.4030 573.4833 599.3668 709.3702 732.7890 765.2539 786.5768 868.5984 926.3168 959.5109 983.9928 1042.9418 1048.8061 1108.9146 1165.9079 1180.8166 1237.8677 1268.7343 1300.1451 1341.8179 1397.9251 1411.6950 1439.1191 1466.5652 1467.1251 1481.7771 1566.6917 1588.8395 1661.5618 2973.3975 3053.0816 3075.9225 3124.0063 3129.9259 3170.4503 3426.1239 3493.9793 3578.2556
redmass: 3.1687 3.4490 1.1067 2.6380 2.9601 2.3868 1.5299 4.1810 3.5271 1.5589 2.9925 3.2037 4.8506 2.5072 1.8283 5.4439 1.2229 4.1020 1.3379 1.3761 1.5936 1.5182 2.6549 1.6481 4.3532 1.7757 1.2090 1.8426 3.0095 3.9465 1.2524 1.6784 3.0191 1.0696 1.6063 1.1360 4.7841 5.4237 1.0729 1.0365 1.0978 1.0986 1.0885 1.0913 1.0990 1.0445 1.0760 1.0999
irintensity: 6.5767 6.1657 0.8411 0.2986 2.1825 14.6720 6.1268 13.6967 2.7608 244.4003 9.3180 60.4758 24.0604 49.5049 126.0339 1.1505 52.1562 6.8054 0.4151 0.1845 6.8844 5.7571 1.4482 14.0955 5.1004 2.6694 11.4181 0.6477 25.9267 5.8973 22.9561 0.5145 214.8876 15.5302 14.3081 20.3315 59.2061 50.7166 15.9709 35.3043 21.6298 22.3220 8.4942 28.8421 24.7698 4.9988 27.3760 1.6963
temp: 298.150 k
press: 1.00000 atm
elementType: 7 7 7 6 6 6 6 6 6 1 1 1 1 1 1 1 1 1
symmnumber: 1
zpe: 386948.7 jmol-1
zpe.correction: 0.147381 hartree
zpe.thermalcorrener: 0.155962 hartree
zpe.thermalcorrenthalpy: 0.156907 hartree
zpe.thermalcorrgfe: 0.114396 hartree
zpe.sumelectzpe: -397.582338 hartree
zpe.sumelectthermal: -397.573756 hartree
zpe.sumelectthermalent: -397.572812 hartree
zpe.sumelectthermalfe: -397.615322 hartree
dipole: 0.4306 2.8162 0.8140
dipole: 2.9630
quadrupole: -48.3090 -53.1806 -55.2242
quadrupole: 2.5927 0.6035 0.0036
quadrupole: 3.9289 -0.9427 -2.9862 2.5927 0.6035 0.0036
hfenergy: -397.7297185 hartree
pointgroup: C01 [X(C6H9N3)]
dipole: -0.1974092 -0.974994 -0.6077248 debye
dipolederiv: -0.9702413 0.095013 -0.1207585 0.1354961 -0.0326132 0.2898628 -0.563795 0.2375809 -0.3132388 -0.7311643 -0.1105499 -0.0531007 0.3056377 -0.3764965 -0.0099282 0.1464267 -0.0364624 -0.2473365 -0.612971 -0.2260982 -0.0792815 -0.5176867 -0.1884708 -0.0273942 -0.0502495 -0.0995937 -0.0142616 -0.4275454 0.0105443 -0.0052199 -0.4275647 0.1768431 -0.01767 -0.21054 0.0366681 -0.0651516 1.4370621 -0.0755241 0.1349219 0.1681389 0.0191397 -0.0761898 0.2699461 -0.0814193 0.0648268 0.3002456 -0.0559739 0.0360361 -0.066998 0.1559615 0.0926145 0.030804 0.0953756 -0.1050458 0.0396954 0.1068865 0.004233 0.0976599 -0.0391792 -0.021151 -0.0013015 -0.0206153 0.0784294 -0.1193714 -0.0641482 0.002046 0.1337068 -0.3792072 -0.0494398 0.0453616 -0.0928694 -0.1911299 0.3395522 0.148391 0.0970285 -0.1707655 0.339086 0.1306122 -0.007501 0.1765408 -0.0202738 0.0459499 -0.06976 -0.0342557 -0.1075063 -0.0502937 -0.0675331 -0.0298798 -0.0610773 0.1176306 0.0120434 0.0738505 0.1281366 0.0237524 0.0364486 0.0066173 0.1188361 -0.0458952 -0.0570717 0.0069696 0.078343 -0.1032734 0.0264242 0.0371106 -0.0061336 -0.1019817 0.0585842 -0.0319767 -0.0461155 -0.1826457 -0.0187188 -0.0567396 -0.0526406 -0.0172474 -0.0043859 -0.0157341 0.1076371 -0.1178875 0.0438908 -0.0317278 0.0253857 0.0938457 -0.0218502 -0.0392513 -0.026732 0.1652916 0.1839827 0.0416343 0.0680275 -0.0112469 0.121667 -0.0992259 0.1495481 -0.054201 0.2711467 0.0213674 0.0851027 0.016091 0.1191633 -0.0713728 -0.0571175 0.0195529 -0.0575298 0.1160071 0.2166579 0.1015877 -0.0984061 0.1746777 0.1866453 -0.0631779 0.0833404 -0.0246988 -0.0064603 0.4217701 -0.0005437 0.0582217 0.1484647 0.0235264 0.0143517 0.1450696 0.0120784 0.1309773 unknown
polarizability: 114.8183758|-11.6024366|90.0417778|2.2690761|13.5083137|50.4486102 unknown
InChI: InChI=1S/C6H9N3/c1-5-3-2-4-8-6(5)9-7/h2-4,9H,7H2,1H3
charge 0 multiplicity 1
18 atoms
N  1.902999 0.334198 0.594796
N  -0.098274 1.506955 0.696161
N  2.839971 -0.310794 -0.247771
C  -0.222437 -0.843584 -0.045735
C  0.507245 0.315695 0.385642
C  -1.615286 -0.675195 -0.22028
C  0.414659 -2.210638 -0.218507
C  -2.249081 0.558523 0.063628
C  -1.446648 1.611449 0.551848
H  -2.212722 -1.533233 -0.551923
H  1.049746 -2.281189 -1.121007
H  1.046927 -2.464867 0.653041
H  -0.367193 -2.986075 -0.301269
H  -3.32721 0.689837 -0.064814
H  2.228417 1.232035 0.967796
H  -1.883025 2.577358 0.831475
H  2.672873 -0.191656 -1.254014
H  3.062937 -1.267219 0.034533
