program: Gaussian 09
title: 000250814
version: EM64L-G09RevD.01
frameworkgroup: C1[X(C12H22Cl2N2O3S)]
method: RPBEPBE
basis: SDD
operation: Freq
keyword: #p
keyword: freq=noraman
keyword: PBEPBE/SDD
title: #p freq=noraman PBEPBE/SDD
converged: YES YES NO NO
title: Mulliken charges:
elementType: Cl Cl S O O O N N C C C C C C C C C C C C H H H H H H H H H H H H H H H H H H H H H H
charge: -0.062332 -0.057292 0.174673 -0.309971 -0.305820 -0.223398 -0.464575 -0.173397 -0.159627 -0.339906 -0.721716 0.299893 -0.328104 -0.405046 0.202936 -0.572590 -0.567446 -0.219359 -0.838049 -0.672666 0.298600 0.270887 0.244027 0.365267 0.264358 0.255957 0.278778 0.228177 0.240641 0.256991 0.255242 0.304739 0.276044 0.279652 0.233282 0.235306 0.253205 0.255141 0.261109 0.237629 0.229443 0.219319
chargesum: 0.00000
title: Mulliken charges with hydrogens summed into heavy atoms:
elementType: Cl Cl S O O O N N C C C C C C C C C C C C
charge: -0.062332 -0.057292 0.174673 -0.309971 -0.305820 -0.223398 -0.099308 -0.173397 0.138973 0.175008 -0.201401 0.299893 0.178850 0.092586 0.202936 -0.012610 -0.011750 0.249229 -0.068594 0.013725
polarizability: 2.19302475e+02 -4.10396370e+00 2.12917983e+02 -4.79292260e+00 -1.37680148e+01 1.48436592e+02
1716.lowfreq: -7.1601 -6.1653 -0.0027 -0.0024 -0.0023 4.3952 13.1096 13.8663 27.5425
frequency: 12.2725 13.1142 27.4511 28.1485 32.9693 42.5295 49.9886 53.4736 68.4514 74.3782 84.4378 91.6825 98.5002 114.1477 133.1298 144.3580 163.2190 176.6151 196.5454 205.9446 214.0028 230.4431 246.5409 262.3041 278.3589 293.5901 327.7436 339.5239 369.7379 394.6244 460.9789 495.5537 538.3864 553.5865 604.2341 627.7625 649.6760 678.3218 693.3324 694.6073 716.9096 755.6999 775.9194 782.1666 789.1573 794.8913 807.0087 851.2047 883.2039 919.3342 958.5400 967.6331 991.3500 999.1309 1016.9936 1023.1745 1034.3646 1048.4657 1067.3793 1069.1563 1111.3848 1121.5868 1126.9013 1136.4126 1143.3060 1193.0082 1211.8410 1221.3230 1236.8283 1248.4742 1250.7557 1255.0332 1259.0533 1272.5804 1287.6014 1301.6125 1309.6997 1341.3515 1343.8448 1350.9224 1357.5886 1363.8770 1382.1629 1406.2028 1436.9415 1447.9118 1448.7326 1455.7655 1462.4222 1463.4878 1466.5740 1466.8590 1474.2852 1482.3099 1487.8807 1502.9396 1597.3943 1649.2060 2996.8403 2999.2572 3004.0285 3004.2128 3006.9591 3016.5580 3021.0877 3027.7841 3060.5127 3063.3739 3069.0758 3072.0800 3075.9820 3093.7419 3093.9187 3098.7099 3108.8505 3118.6722 3130.5582 3148.4222 3153.6825 3558.4971
redmass: 5.5798 9.2968 4.0953 4.2643 7.7733 11.0848 2.7568 5.7494 5.4081 3.2059 3.1644 3.2246 4.4673 2.5447 1.1404 2.5986 3.3652 4.5532 4.3328 4.5155 3.9273 5.0627 2.0044 1.7483 4.1601 5.1221 3.9210 4.2668 3.5697 3.6233 4.7277 2.6099 1.6671 4.5829 5.2738 4.4538 5.4451 6.0177 4.9409 5.6592 6.5911 1.4146 1.2246 3.8735 1.1776 1.2603 2.6804 4.8786 4.2463 2.2277 1.3507 1.3525 1.8745 1.4943 1.7920 2.5405 4.4879 3.2468 2.1926 2.7376 2.1865 1.3966 1.5535 1.4766 3.2057 1.7071 1.3246 1.8900 2.2684 1.1343 1.2195 1.2560 1.1974 1.3199 1.1414 1.3305 1.3489 1.1480 1.3798 1.3098 1.3760 1.3078 1.5454 1.2529 1.0881 1.0598 1.0966 1.1155 1.0708 1.0868 1.0628 1.0534 1.1005 1.6947 1.1831 1.0928 7.1429 10.6561 1.0361 1.0568 1.0594 1.0377 1.0764 1.0582 1.0646 1.0616 1.0577 1.0573 1.1019 1.0994 1.1065 1.1047 1.0989 1.1031 1.1034 1.1053 1.1028 1.1121 1.1117 1.0770
irintensity: 0.3274 0.0803 0.7542 1.1726 0.5373 1.2350 0.5116 4.2913 1.2496 1.6387 1.7970 2.4907 6.5270 3.6042 0.2759 2.9258 2.3515 5.6143 1.3475 2.6944 0.9101 9.3440 3.8187 0.0725 0.2216 8.8804 12.7678 20.3529 1.9448 7.2861 13.7821 23.9259 97.1546 13.7446 30.9568 5.1840 3.0920 24.7514 18.4794 39.7205 40.4897 19.7522 10.3011 3.0867 10.7291 6.3244 3.9866 3.2647 7.8349 12.6302 30.6834 15.8539 22.2443 6.3083 5.8028 99.9195 0.7592 3.9740 10.4186 20.8826 6.5262 28.2388 55.3289 5.4681 166.0833 51.8561 33.2148 114.5808 12.1442 0.3679 13.9347 7.0288 20.3623 57.6885 12.9890 1.5850 30.0767 2.5014 13.3117 4.2295 2.8153 12.3148 20.2131 17.7501 1.5187 20.7426 15.3272 28.6040 0.5303 14.9766 46.5858 13.8119 55.1179 446.2736 215.4488 31.2701 229.2786 145.6864 12.9289 20.4011 17.3796 27.4559 12.8182 18.3980 17.3852 14.8961 15.5893 15.0818 2.7507 10.8970 4.0099 8.4695 36.6920 2.1532 38.0206 20.9265 12.1273 11.2258 7.4623 59.5401
temp: 298.150 k
press: 1.00000 atm
elementType: 17 17 16 8 8 8 7 7 6 6 6 6 6 6 6 6 6 6 6 6 1 1 1 1 1 1 1 1 1 1 1 1 1 1 1 1 1 1 1 1 1 1
symmnumber: 1
zpe: 885327.6 jmol-1
zpe.correction: 0.337203 hartree
zpe.thermalcorrener: 0.362717 hartree
zpe.thermalcorrenthalpy: 0.363662 hartree
zpe.thermalcorrgfe: 0.274733 hartree
zpe.sumelectzpe: -2122.249744 hartree
zpe.sumelectthermal: -2122.224230 hartree
zpe.sumelectthermalent: -2122.223286 hartree
zpe.sumelectthermalfe: -2122.312214 hartree
dipole: -2.2594 4.4305 -1.2483
dipole: 5.1276
quadrupole: -148.9103 -148.8760 -152.1153
quadrupole: 5.4904 0.9966 2.9102
quadrupole: 1.0569 1.0912 -2.1481 5.4904 0.9966 2.9102
hfenergy: -2122.5869471 hartree
pointgroup: C01 [X(C12H22Cl2N2O3S1)]
dipole: 0.9002009 -1.7541906 -0.4268585 debye
polarizability: 219.3251744|-3.9257233|213.7673829|5.0364272|11.4662794|147.5644926 unknown
InChI: InChI=1S/C12H22Cl2N2O3S/c1-3-19-11(17)10(4-9-20-2)15-12(18)16(7-5-13)8-6-14/h10,15H,3-9H2,1-2H3
charge 0 multiplicity 1
42 atoms
Cl -5.702025 2.417818 -0.289993
Cl -1.967683 -3.9627 -1.285662
S  2.715156 3.140177 -1.933446
O  1.89636 -1.787603 0.335473
O  -1.36034 1.528721 1.422641
O  3.34549 -0.563749 1.69528
N  -0.020805 -0.053301 0.358376
N  -2.374051 -0.037405 0.004392
C  1.191601 0.432299 1.030347
C  1.780134 1.728728 0.383245
C  2.219711 1.531048 -1.07515
C  -1.249502 0.531902 0.638398
C  -3.694355 0.559714 0.304244
C  -2.29205 -1.195679 -0.901574
C  2.259885 -0.663162 1.08523
C  -3.957078 1.767269 -0.610517
C  -2.246982 -2.513408 -0.101066
C  2.869504 -2.928488 0.300508
C  4.296013 3.533312 -0.985761
C  2.335726 -3.937151 -0.710686
H  0.931986 0.696593 2.074293
H  0.996846 2.504177 0.443973
H  2.632816 2.055286 1.006102
H  0.082604 -0.906765 -0.190772
H  1.386769 1.144075 -1.688179
H  3.071985 0.831772 -1.159277
H  -3.711434 0.890982 1.355272
H  -4.47763 -0.205504 0.160992
H  -1.409226 -1.123193 -1.564536
H  -3.173998 -1.199524 -1.564922
H  -3.928871 1.505907 -1.67941
H  -3.273998 2.597386 -0.383683
H  -3.195892 -2.722224 0.413923
H  -1.408398 -2.545693 0.609902
H  2.934966 -3.342399 1.322604
H  3.859826 -2.52517 0.024534
H  4.768963 4.376407 -1.513094
H  4.972577 2.663335 -1.003016
H  4.07383 3.826468 0.051718
H  1.326261 -4.28801 -0.43547
H  2.287836 -3.498767 -1.722098
H  3.008377 -4.813278 -0.746337
