program: Gaussian 09
title: 000250810
version: EM64L-G09RevD.01
frameworkgroup: C1[X(C7H8N2O2)]
method: RPBEPBE
basis: SDD
operation: Freq
keyword: #pfreq=noraman
keyword: PBEPBE/SDD
title: #p freq=noraman PBEPBE/SDD
converged: NO YES NO NO
title: Mulliken charges:
elementType: O O N N C C C C C C C H H H H H H H H
charge: -0.253564 -0.280620 -0.040596 -0.636877 0.266788 -0.240694 -0.295509 0.138853 -0.449368 0.164882 -0.509194 0.290123 0.258478 0.218193 0.238738 0.232030 0.238824 0.319947 0.339564
chargesum: 0.00000
title: Mulliken charges with hydrogens summed into heavy atoms:
elementType: O O N N C C C C C C C
charge: -0.253564 -0.280620 -0.040596 0.022634 0.266788 0.049429 -0.037031 0.138853 -0.231175 0.164882 0.200398
polarizability: 1.52321473e+02 -1.93776438e-01 9.80754033e+01 2.34645338e-02 7.36854711e-03 4.36693807e+01
1716.lowfreq: -36.5715 -7.6245 -5.7609 0.0004 0.0007 0.0008 10.4969 76.7368 135.5584
frequency: -35.6738 76.7271 135.5549 161.6024 163.2701 249.7796 279.9264 330.4554 402.3967 454.6383 458.0016 478.8271 512.6555 586.0203 589.2546 625.4439 687.9436 709.9852 773.8627 807.0739 859.2304 906.0999 967.9160 984.5306 1005.1948 1045.3364 1113.7858 1114.2358 1134.4018 1149.4379 1263.2113 1304.1376 1343.8015 1358.4604 1363.0961 1430.4393 1450.0182 1465.1008 1481.5257 1535.6660 1583.8612 1597.7513 1634.0779 3001.7519 3103.4988 3104.5189 3142.3298 3161.8733 3185.7059 3528.7064 3682.2232
redmass: 4.1478 4.7234 1.6017 4.2169 1.7618 4.1082 5.0285 6.0534 2.6479 1.5285 4.4721 3.9825 2.1609 1.2703 4.5953 7.8216 4.6898 4.7236 5.1395 6.3209 1.4910 1.5672 8.4161 3.5256 1.3299 1.9843 1.6146 1.2538 1.9460 1.3594 2.7910 2.0967 3.7607 2.8816 4.3105 1.2862 1.0508 1.0544 2.3722 6.8158 2.3151 6.0981 1.9586 1.0292 1.1043 1.0912 1.1050 1.0899 1.0975 1.0449 1.1039
irintensity: 15.4765 0.5531 5.6201 1.3839 6.0158 26.0953 2.0598 1.9198 4.8360 71.7174 3.8375 6.4413 96.9082 96.2041 26.6171 0.1252 0.7078 40.7993 27.0029 4.3188 35.1036 11.3286 62.2200 6.1689 1.1177 2.1039 17.0375 0.2384 18.1524 18.3104 167.3547 48.6748 104.8228 65.8912 328.0234 4.6583 13.5141 25.9418 84.0401 9.0356 108.4222 218.0018 276.9373 51.9720 29.3851 36.4649 22.3246 0.1952 4.0056 41.2430 31.5894
temp: 298.150 k
press: 1.00000 atm
elementType: 8 8 7 7 6 6 6 6 6 6 6 1 1 1 1 1 1 1 1
symmnumber: 1
zpe: 379726.7 jmol-1
zpe.correction: 0.144630 hartree
zpe.thermalcorrener: 0.154061 hartree
zpe.thermalcorrenthalpy: 0.155006 hartree
zpe.thermalcorrgfe: 0.109882 hartree
zpe.sumelectzpe: -530.694713 hartree
zpe.sumelectthermal: -530.685281 hartree
zpe.sumelectthermalent: -530.684337 hartree
zpe.sumelectthermalfe: -530.729460 hartree
dipole: -1.4894 -3.3556 -0.0472
dipole: 3.6716
quadrupole: -61.2194 -57.9425 -66.3059
quadrupole: -10.2642 -0.1641 0.0195
quadrupole: 0.6032 3.8801 -4.4833 -10.2642 -0.1641 0.0195
hfenergy: -530.8393428 hartree
pointgroup: C01 [X(C7H8N2O2)]
dipole: -0.5856001 1.320356 0.0189402 debye
dipolederiv: -1.8837598 0.2408461 0.0002793 0.0871554 -0.3827425 0.0002837 0.0014266 0.0001103 -0.3114721 -0.9692168 0.265665 0.0031927 0.1617569 -0.8514317 -0.0059877 0.0007348 -0.0052485 -0.3786752 -0.9460493 0.0555193 0.0006814 -0.5395573 -0.3780046 0.0012616 0.0035244 0.0007751 -0.2151563 -0.675707 -0.4356084 -0.0065122 -0.5049883 -0.9315725 -0.0001658 -0.0068816 0.0013059 -0.7076729 -0.7708047 0.0118863 0.0004643 -0.1115555 -0.3019353 0.0004809 0.00088 0.0009106 0.0135404 0.349694 0.0231583 -0.000279 0.2229664 0.1671318 -0.0014598 0.0003125 -0.0002407 -0.081239 -0.6038239 0.0447957 0.0000922 0.3816449 0.0181048 -0.0007585 -0.0004226 -0.0005921 -0.1507537 1.9251907 -0.0656605 -0.0014384 0.261099 0.2076058 -0.0005469 -0.0038034 -0.0003329 0.1658003 0.5465146 -0.1030275 -0.0003692 0.0762228 0.3025914 -0.0026745 -0.0036606 -0.0026996 -0.0769284 1.7729557 0.1525909 0.0002931 0.2939862 1.4222494 0.0132951 0.0029127 0.0110899 0.2540504 0.7101766 -0.1638673 0.000364 -0.4270292 0.3920092 -0.0001578 0.0010865 -0.0002393 0.2758287 0.119283 0.0875912 -0.0004223 0.0388908 0.0573976 0.000584 -0.0008533 -0.0001534 0.1499572 0.0664036 -0.0610409 0.0002669 -0.0638037 -0.0178332 0.000857 0.0002264 0.0007829 0.1729725 0.0126505 -0.1049921 0.0002972 -0.1401891 -0.0853784 0.0011339 0.0015037 0.0007274 0.1243394 0.0501849 -0.0177377 -0.0584562 0.1240468 -0.008897 -0.0840834 -0.0019456 -0.0980626 -0.0618145 -0.1578123 -0.0285198 0.00044 -0.0905215 0.0648244 0.0003735 0.0007573 0.0002851 0.1230453 0.050188 -0.0169177 0.0583008 0.1242584 -0.0072225 0.0833076 0.0006489 0.0975521 -0.0635087 0.2065065 0.088733 0.0020867 0.0855514 0.1499604 -0.0031945 0.0024933 -0.0036269 0.3808942 0.1974259 0.0265862 0.0007188 0.0200657 0.1831427 -0.0025485 0.00106 -0.0023432 0.3867922 unknown
polarizability: 152.3215361|0.1788528|98.075299|-0.0698389|0.0122029|43.6694223 unknown
InChI: InChI=1S/C7H8N2O2/c1-11-6-3-2-5(4-9-6)7(8)10/h2-4H,8H2,1H3
charge 0 multiplicity 1
19 atoms
O  -3.066775 -0.418481 0.002766
O  3.298983 -0.930057 -0.014771
N  -1.173563 1.002032 -0.005929
N  3.137064 1.377196 0.007685
C  1.06985 0.019166 -0.002382
C  0.489033 -1.283719 0.002842
C  -0.901655 -1.433525 0.004445
C  -1.694865 -0.251739 0.000356
C  0.185002 1.122152 -0.007344
C  2.571177 0.111854 -0.003921
C  -3.894316 0.807403 -0.001798
H  1.162029 -2.146783 0.00525
H  -1.387447 -2.41198 0.008635
H  0.545457 2.158845 -0.014578
H  -3.686714 1.418498 0.892728
H  -4.92882 0.43478 0.00109
H  -3.688783 1.410398 -0.902277
H  2.59377 2.236926 0.022666
H  4.154871 1.434533 0.005735
