program: Gaussian 09
title: 000250804
version: EM64L-G09RevD.01
frameworkgroup: C1[X(C23H34O3)]
method: RPBEPBE
basis: SDD
operation: Freq
keyword: #pfreq=noraman
keyword: PBEPBE/SDD
title: #p freq=noraman PBEPBE/SDD
converged: NO YES NO NO
title: Mulliken charges:
elementType: O O O C C C C C C C C C C C C C C C C C C C C C C C H H H H H H H H H H H H H H H H H H H H H H H H H H H H H H H H H H
charge: -0.279512 -0.195761 -0.221957 0.363718 -0.155025 -0.126257 -0.093914 0.343609 0.347638 -0.523900 -0.553253 -0.549476 -0.083256 -0.518487 -0.528007 -0.472239 -0.799111 -0.493370 -0.531013 -0.805245 -0.594653 -0.528338 -0.437426 0.169743 -0.495291 0.159448 0.202099 0.238672 0.189030 0.201537 0.211051 0.229097 0.206696 0.221227 0.231433 0.210007 0.224667 0.207884 0.257677 0.213759 0.201537 0.217851 0.237370 0.248179 0.213361 0.217948 0.214389 0.229193 0.214529 0.225057 0.221257 0.216645 0.242947 0.233752 0.222701 0.242347 0.244435 0.222498 0.254503 0.235999
chargesum: 0.00000
title: Mulliken charges with hydrogens summed into heavy atoms:
elementType: O O O C C C C C C C C C C C C C C C C C C C C C C C
charge: -0.279512 -0.195761 -0.221957 0.363718 0.047074 0.112415 0.095116 0.343609 0.347638 -0.111312 -0.117460 -0.096815 0.126751 -0.085937 -0.056571 -0.052851 -0.100201 -0.061033 -0.087291 -0.142286 -0.117953 -0.063290 0.029506 0.169743 -0.004789 0.159448
polarizability: 2.92703833e+02 2.99084604e+00 2.22890850e+02 -1.03655897e+01 -2.03161269e+00 2.09284599e+02
1716.lowfreq: -22.8726 -7.0178 -0.0006 -0.0004 0.0004 10.0210 28.9133 33.9445 40.8632
frequency: 28.4615 33.9049 40.7434 62.3100 76.7204 99.0827 119.9680 128.7364 156.5966 169.0401 178.6879 192.7308 214.4850 228.8643 238.5470 264.4171 270.7375 281.6329 297.3827 302.0041 313.5483 318.0287 353.4983 361.5785 372.6311 380.3364 397.0160 406.5033 414.8161 434.1773 451.5740 470.6799 473.1679 477.4590 492.6353 511.3139 511.6688 536.5180 552.0173 573.9309 596.9643 617.2489 666.1911 672.5103 682.6645 727.0053 759.9057 768.2704 776.6083 806.1908 816.7993 832.6415 842.2461 856.7621 872.8726 875.0553 881.9737 903.2639 907.9705 920.1604 925.8546 948.3555 948.9853 972.2265 980.7183 986.5851 990.0953 995.6232 1006.2193 1014.1711 1018.2568 1036.7662 1049.3688 1058.8934 1068.8330 1071.5881 1077.0021 1090.3661 1098.2221 1102.0109 1115.9056 1124.1251 1133.1844 1139.5111 1147.8420 1151.5494 1159.4192 1171.2966 1181.7274 1195.9930 1207.1790 1211.8268 1215.8242 1220.5400 1227.4995 1238.0899 1252.4677 1254.5840 1259.6680 1262.8608 1264.2950 1271.7231 1291.4718 1295.6187 1301.4758 1306.8745 1313.7275 1317.0723 1321.5972 1323.8402 1329.6952 1332.7963 1335.1057 1338.7392 1342.5819 1347.3535 1349.7565 1353.5286 1354.1501 1366.2667 1390.7979 1400.0887 1442.4826 1444.8040 1454.1950 1457.8073 1462.4752 1465.5183 1470.3698 1470.5187 1470.8615 1476.1490 1477.4256 1480.0649 1481.4623 1488.1550 1489.0440 1492.1428 1633.9701 1647.6015 2911.4401 2917.2491 2951.7384 2954.9035 2956.6906 2968.4210 2973.3773 2977.6934 2979.7953 2981.3506 2983.1399 2984.9146 2988.3284 2989.2404 2995.7934 3006.6134 3009.5866 3014.2690 3018.0849 3021.9032 3032.4512 3035.7553 3043.1653 3044.7074 3054.6179 3060.3012 3062.6429 3067.9714 3070.2480 3080.3184 3081.3952 3081.5897 3098.0714 3099.6928
redmass: 6.0308 5.8888 4.8237 4.7168 2.8013 2.6727 3.6690 2.8358 2.1117 2.3006 3.8263 1.1084 1.8461 2.3235 3.3182 2.2651 2.8710 2.5898 2.6625 2.9764 2.6989 2.3648 2.3282 2.8735 2.6649 3.2098 2.9330 2.9476 2.9163 3.4319 2.9999 2.4909 3.0731 2.9706 2.9144 3.2517 2.7761 2.4707 3.1240 4.9741 2.9419 2.8033 3.2399 2.9605 2.7946 2.3171 2.6184 3.0397 1.6170 2.0972 2.8853 1.8756 1.8606 2.0397 2.4297 2.2776 2.3419 1.9613 1.9851 1.9296 2.1613 1.8109 1.9245 1.7885 2.1892 2.4600 2.3007 1.9328 1.9388 2.0429 2.0358 2.3318 1.8390 2.3688 2.0196 2.3812 1.6435 2.2631 1.9371 1.3808 2.3851 2.1644 2.1428 1.9904 1.7034 1.7596 2.8521 1.9970 1.7779 1.5368 1.8565 1.4774 1.6281 1.6557 1.9793 1.4494 1.6089 1.5784 1.4439 1.3988 1.5423 1.6734 1.4603 1.3620 1.4539 1.3195 1.3915 1.4095 1.4997 1.3536 1.4589 1.4701 1.3287 1.4171 1.4336 1.4300 1.4081 1.3655 1.4594 1.4887 1.1978 1.1923 1.0780 1.0924 1.0871 1.0743 1.0769 1.0757 1.0788 1.0677 1.0752 1.0856 1.0803 1.0664 1.0841 1.0605 1.0811 1.0630 9.2402 11.8506 1.0805 1.0789 1.0697 1.0785 1.0598 1.0768 1.0586 1.0515 1.0614 1.0611 1.0637 1.0621 1.0664 1.0609 1.0610 1.0378 1.0629 1.0644 1.0992 1.0956 1.1010 1.0982 1.0986 1.0983 1.1003 1.0976 1.0979 1.0976 1.0975 1.1001 1.0983 1.1007 1.0983 1.0987
irintensity: 3.2266 3.6177 0.4947 1.9355 0.9974 3.4814 2.3184 1.1795 0.2721 0.1753 0.0058 0.0666 1.8039 0.0945 0.6262 0.2263 1.7934 0.2106 1.0002 2.2428 0.1383 0.2617 0.8373 0.7250 0.4951 1.1797 0.9066 3.3831 1.1628 1.1242 1.2848 0.7554 0.1160 3.5704 3.1784 8.1085 4.7339 1.2413 1.2730 4.4690 2.9292 0.8356 5.5843 6.1968 4.7613 0.7482 5.8365 4.0674 1.4801 0.7375 2.1550 8.0455 7.1747 2.7283 2.9100 9.3985 16.7315 2.2603 1.5680 4.4161 0.2977 0.5285 3.0644 15.3669 110.6121 47.2532 40.0272 22.0280 7.8813 10.0250 32.2170 4.9721 29.3670 1.1908 3.0279 11.1158 36.2258 3.4387 6.4190 3.7809 12.5705 4.1758 5.7261 0.6566 14.5518 2.3108 118.0565 14.7912 7.2470 6.7826 1.7010 16.6772 124.8877 9.7285 7.3263 7.8341 9.2774 4.6000 20.5781 1.2693 15.6739 3.7141 1.9140 10.5435 2.6631 1.7576 7.8461 1.6044 12.6387 4.9846 5.0513 1.9858 1.0824 1.6689 6.2669 5.4291 0.5204 0.3389 1.8929 0.1366 21.2341 28.8548 12.5785 13.3718 15.7863 1.5621 15.8906 8.3326 30.8167 2.8296 5.6735 5.3960 11.8827 4.1186 5.8717 8.9053 16.0469 8.7951 234.6294 328.2461 4.3559 30.8401 16.9069 8.4453 44.1376 24.2219 11.2962 35.0306 3.7923 63.6374 21.2459 29.2824 13.5009 58.3957 26.1191 25.7993 31.2393 27.7025 30.7016 37.0189 45.1554 44.4631 25.7105 60.7610 19.1471 17.8060 58.0115 25.8171 27.5148 5.5000 46.4502 41.5796 26.7544 27.8106
temp: 298.150 k
press: 1.00000 atm
elementType: 8 8 8 6 6 6 6 6 6 6 6 6 6 6 6 6 6 6 6 6 6 6 6 6 6 6 1 1 1 1 1 1 1 1 1 1 1 1 1 1 1 1 1 1 1 1 1 1 1 1 1 1 1 1 1 1 1 1 1 1
symmnumber: 1
zpe: 1380692.5 jmol-1
zpe.correction: 0.525878 hartree
zpe.thermalcorrener: 0.549864 hartree
zpe.thermalcorrenthalpy: 0.550808 hartree
zpe.thermalcorrgfe: 0.473966 hartree
zpe.sumelectzpe: -1120.515763 hartree
zpe.sumelectthermal: -1120.491777 hartree
zpe.sumelectthermalent: -1120.490833 hartree
zpe.sumelectthermalfe: -1120.567675 hartree
dipole: 0.7009 0.5555 -1.8229
dipole: 2.0304
quadrupole: -216.7556 -154.7726 -159.6977
quadrupole: 17.8613 31.6942 -3.2162
quadrupole: -39.6803 22.3027 17.3776 17.8613 31.6942 -3.2162
hfenergy: -1121.0416405 hartree
pointgroup: C01 [X(C23H34O3)]
dipole: -0.2815753 -0.2876707 -0.6900033 debye
polarizability: 292.8648068|4.2188148|223.1820663|9.2037681|0.6797589|208.8324091 unknown
InChI: InChI=1S/C23H34O3/c1-21-11-7-16(24)14-15(21)5-6-17-18(21)8-12-22(2)19(17)9-13-23(22)10-3-4-20(25)26-23/h15,17-19H,3-14H2,1-2H3
charge 0 multiplicity 1
60 atoms
O  4.120726 -0.290171 0.370946
O  -5.716294 1.686885 -1.591915
O  6.025543 0.673535 1.146225
C  1.596583 -0.291159 0.374882
C  0.595566 -1.136309 -0.479468
C  -0.794522 -1.297429 0.172449
C  -1.406601 0.122073 0.429651
C  -2.851607 0.041401 1.05599
C  2.901026 -0.417048 -0.519036
C  0.983718 1.117508 0.577064
C  -0.426665 1.03255 1.223608
C  1.394338 -2.413849 -0.842707
C  -3.774281 -0.837487 0.133392
C  -1.733673 -2.156852 -0.709301
C  2.868787 -1.915946 -0.984052
C  -3.164795 -2.238359 -0.133108
C  1.883494 -0.938939 1.759852
C  -3.514685 1.447609 1.201726
C  2.989183 0.562759 -1.715594
C  -2.814042 -0.577273 2.482887
C  -4.132803 -0.13898 -1.217877
C  -3.807355 2.170041 -0.139831
C  3.600015 1.932839 -1.356531
C  -4.655067 1.282437 -1.044733
C  5.030658 1.724046 -0.828174
C  5.108785 0.698154 0.298207
H  0.424482 -0.574705 -1.427454
H  -0.666994 -1.821763 1.142313
H  -1.506995 0.58402 -0.5798
H  0.882139 1.630684 -0.401059
H  1.638814 1.745308 1.213345
H  -0.335643 0.67602 2.266277
H  -0.837537 2.058671 1.283438
H  1.026628 -2.886067 -1.77024
H  1.306692 -3.166701 -0.03705
H  -4.730951 -0.978135 0.681189
H  -1.318956 -3.177977 -0.811946
H  -1.758895 -1.730697 -1.734361
H  3.559135 -2.491535 -0.344267
H  3.233558 -2.008596 -2.022404
H  -3.821795 -2.799702 -0.826988
H  -3.145004 -2.815443 0.812179
H  2.354581 -1.931639 1.667437
H  2.583356 -0.309198 2.33372
H  0.961187 -1.057659 2.352167
H  -2.894173 2.100683 1.843008
H  -4.475219 1.314167 1.740548
H  1.981855 0.684764 -2.154117
H  3.617866 0.103776 -2.504315
H  -2.302062 -1.55356 2.511745
H  -2.298115 0.092068 3.195142
H  -3.843149 -0.729701 2.860396
H  -4.888255 -0.731359 -1.764368
H  -3.230103 -0.084032 -1.859828
H  -2.853615 2.397652 -0.658472
H  -4.33513 3.125303 0.025794
H  2.991313 2.451691 -0.595879
H  3.62174 2.580877 -2.25204
H  5.484637 2.655808 -0.450739
H  5.686373 1.360145 -1.645024
