program: Gaussian 09
title: 000250800
version: EM64L-G09RevD.01
frameworkgroup: C1[X(C23H32O3)]
method: RPBEPBE
basis: SDD
operation: Freq
keyword: #pfreq=noraman
keyword: PBEPBE/SDD
title: #p freq=noraman PBEPBE/SDD
converged: NO YES NO NO
title: Mulliken charges:
elementType: O O O C C C C C C C C C C C C C C C C C C C C C C C H H H H H H H H H H H H H H H H H H H H H H H H H H H H H H H H
charge: -0.258622 -0.211607 -0.235185 0.371743 -0.156983 -0.146515 -0.095648 0.366057 -0.542557 -0.568328 0.228853 -0.544035 -0.516806 -0.483160 -0.813540 -0.569611 0.538610 -0.641074 -0.491870 -0.809537 -0.427024 -0.564315 -0.586092 -0.520632 0.148665 0.178401 0.218272 0.238597 0.200893 0.211043 0.229762 0.220032 0.232912 0.223364 0.226654 0.239075 0.222202 0.227925 0.215195 0.228796 0.260503 0.213135 0.250046 0.232710 0.223150 0.235333 0.217621 0.216275 0.220982 0.229904 0.234705 0.232439 0.215601 0.245779 0.231709 0.255241 0.251399 0.249553
chargesum: 0.00000
title: Mulliken charges with hydrogens summed into heavy atoms:
elementType: O O O C C C C C C C C C C C C C C C C C C C C C C C
charge: -0.258622 -0.211607 -0.235185 0.371743 0.061289 0.092082 0.105245 0.366057 -0.101752 -0.115384 0.228853 -0.094017 -0.055529 -0.040040 -0.111105 -0.086854 0.538610 -0.182591 -0.057974 -0.123946 0.021017 -0.086827 -0.330851 -0.019681 0.148665 0.178401
polarizability: 3.30416599e+02 -4.79368751e-01 2.16546304e+02 -1.67041449e+01 1.73349809e+00 1.96909887e+02
1716.lowfreq: -18.6249 -10.0462 -6.7758 -0.0006 -0.0004 0.0007 26.3989 40.5194 52.6484
frequency: 25.5495 40.1735 52.5869 67.6988 91.4775 115.3715 134.7596 142.5154 146.2035 169.9024 174.8777 182.3559 203.7016 218.6619 225.7164 234.1414 257.8390 270.3963 280.9318 289.3577 314.2465 322.0101 342.7217 351.8960 372.3819 384.9946 399.4761 424.8639 430.7104 447.3048 449.4382 460.8276 480.9529 498.1102 507.8100 527.1813 535.9395 558.0291 574.3096 597.1664 615.6962 643.7385 664.0835 680.1651 726.3444 742.2229 772.0081 774.5989 790.9467 806.7611 810.5366 834.6277 842.9783 861.5442 876.3351 885.4481 893.7184 908.9962 915.4575 922.4527 933.3445 947.5146 960.6768 966.0203 970.7683 982.3956 999.8302 1007.5156 1016.8230 1027.5641 1033.8433 1041.9033 1062.7507 1070.9453 1078.6574 1079.2322 1102.0176 1110.9673 1112.3881 1121.4794 1122.5487 1133.0882 1148.7311 1155.0488 1161.5840 1184.9007 1186.2175 1189.0686 1200.9468 1209.8812 1222.3687 1223.8459 1229.6768 1233.4326 1240.5569 1252.1126 1257.7797 1270.4816 1278.2372 1282.2987 1285.2718 1293.8832 1301.0766 1304.0263 1316.0128 1319.6003 1321.7081 1328.4711 1334.2682 1339.3703 1341.8638 1343.8649 1347.0402 1352.1948 1353.0929 1362.0869 1392.7625 1399.5102 1442.8101 1453.2518 1456.6131 1458.3456 1460.2841 1465.5846 1467.5895 1467.8320 1472.4242 1478.5186 1483.5649 1485.7768 1488.8151 1492.1442 1495.6780 1585.9198 1622.5065 1662.4552 2909.8218 2918.6329 2951.6208 2961.3923 2971.1382 2972.5672 2974.9095 2981.5502 2986.6557 2995.1930 2995.9238 2996.7128 2997.8503 3005.7228 3010.7494 3014.5082 3031.0663 3033.3911 3038.8996 3042.8072 3048.3466 3049.9889 3052.8014 3061.8126 3067.7322 3075.7142 3077.5304 3082.9512 3093.0645 3093.2923 3105.9763 3117.0898
redmass: 6.4170 4.1747 4.8637 5.0343 2.7253 2.5188 3.6936 2.7539 2.6528 5.1043 1.9936 1.9851 2.5961 1.6645 1.6165 1.9644 2.4374 2.7335 2.5270 2.2447 2.7676 2.4978 3.1278 3.9212 2.7811 3.0614 3.0827 3.2001 3.5362 5.1415 3.1445 3.1685 3.1020 2.8313 3.6393 2.7200 2.5449 2.7676 3.9240 4.6245 3.8735 3.5632 2.8442 3.2287 2.2893 2.2351 1.8466 2.0871 3.3480 2.1870 1.8160 2.2379 2.2177 2.3068 2.1509 1.5350 2.9849 2.1561 1.9597 1.9342 1.7561 1.9188 2.2311 2.3802 2.0784 2.4279 2.1960 1.9182 2.4552 2.0424 1.8328 1.9546 2.1978 2.4089 2.6052 2.2672 1.6476 2.3725 1.9110 1.8946 2.4164 2.2279 2.0896 2.0152 2.0763 1.5258 1.8418 1.8515 1.7464 1.7556 1.5912 1.5176 1.4094 1.5491 1.5423 1.3580 1.2902 1.6570 1.9643 1.3673 1.3793 1.3528 1.4201 1.4113 1.4557 1.3756 1.4622 1.3860 1.4216 1.6773 1.4077 1.8207 1.4189 1.3828 1.4645 1.4894 1.1985 1.1888 1.0790 1.0753 1.0867 1.0808 1.0713 1.0838 1.0830 1.0872 1.0746 1.0788 1.0540 1.0598 1.0780 1.0763 1.0657 10.0868 7.7168 11.3436 1.0815 1.0793 1.0665 1.0705 1.0675 1.0649 1.0647 1.0626 1.0371 1.0596 1.0598 1.0594 1.0653 1.0386 1.0642 1.0617 1.0995 1.0969 1.0972 1.0986 1.1003 1.1027 1.1013 1.0959 1.1027 1.1036 1.0989 1.0989 1.0968 1.0979 1.0990 1.0911
irintensity: 3.6071 4.3168 1.1645 0.6043 0.9700 2.0452 0.9489 1.2402 2.0614 1.7467 0.8652 0.4912 0.3859 0.1844 0.7830 0.1583 0.2359 0.7276 1.0132 0.4706 0.9921 1.5160 2.3789 0.8231 2.1869 1.8528 1.2512 1.0630 0.9388 1.7267 6.6794 0.2778 0.7343 3.1459 3.0059 0.1147 0.3020 1.5069 4.7544 3.3434 4.8529 0.1259 5.2322 4.6511 2.0687 1.4794 5.5930 4.8396 10.2605 0.1411 2.4597 4.4588 2.1184 19.1491 0.6117 23.2995 16.3017 13.4421 8.6984 4.3902 1.7671 42.8196 41.9663 30.1777 13.0744 29.1586 4.6728 9.6688 85.6593 10.9262 4.5722 11.6429 11.2388 22.7133 13.6532 30.1363 10.0511 3.8353 2.1233 6.6778 19.0746 6.8936 73.3754 0.2096 12.8848 35.4745 12.3113 16.0454 14.7429 0.6678 34.0354 39.3249 4.0941 49.1863 7.1112 0.7913 3.1407 2.4143 35.0102 7.3234 1.3404 5.7716 10.1549 3.8616 0.8442 2.1591 10.7658 10.3388 1.1597 4.7877 8.3843 7.0532 3.3186 0.9981 2.9361 1.7041 13.8808 29.3172 18.5660 11.8346 22.0726 7.3126 12.0231 3.9882 11.7524 4.5553 4.5092 11.0215 6.6715 0.9521 15.0643 7.9376 9.9852 160.8794 212.9283 363.1451 6.2020 21.5584 14.8992 11.0008 18.5945 51.1349 28.4763 23.2313 22.3828 16.3614 21.3358 32.9079 19.4787 25.9643 23.3200 33.1603 21.9091 44.8206 22.5312 58.9181 10.0210 13.2669 37.9178 22.5306 23.6742 51.4728 39.8919 24.1225 25.5990 31.8344 22.6083 10.9726
temp: 298.150 k
press: 1.00000 atm
elementType: 8 8 8 6 6 6 6 6 6 6 6 6 6 6 6 6 6 6 6 6 6 6 6 6 6 6 1 1 1 1 1 1 1 1 1 1 1 1 1 1 1 1 1 1 1 1 1 1 1 1 1 1 1 1 1 1 1 1
symmnumber: 1
zpe: 1320535.7 jmol-1
zpe.correction: 0.502965 hartree
zpe.thermalcorrener: 0.526716 hartree
zpe.thermalcorrenthalpy: 0.527660 hartree
zpe.thermalcorrgfe: 0.451580 hartree
zpe.sumelectzpe: -1119.336014 hartree
zpe.sumelectthermal: -1119.312263 hartree
zpe.sumelectthermalent: -1119.311319 hartree
zpe.sumelectthermalfe: -1119.387399 hartree
dipole: 1.8532 3.1886 0.5634
dipole: 3.7309
quadrupole: -226.0412 -153.6779 -156.9089
quadrupole: 20.1746 32.3469 -3.6900
quadrupole: -47.1652 25.1981 21.9671 20.1746 32.3469 -3.6900
hfenergy: -1119.8389792 hartree
pointgroup: C01 [X(C23H32O3)]
dipole: 0.7217192 -1.2550706 -0.2417512 debye
polarizability: 330.6804187|-0.1894519|216.5041325|15.6276064|1.884529|196.688239 unknown
InChI: InChI=1S/C23H32O3/c1-21-11-7-16(24)14-15(21)5-6-17-18(21)8-12-22(2)19(17)9-13-23(22)10-3-4-20(25)26-23/h14,17-19H,3-13H2,1-2H3
charge 0 multiplicity 1
58 atoms
O  4.065227 0.712074 0.559256
O  6.204592 1.507918 0.627502
O  -6.756855 0.225292 -1.425615
C  1.62394 0.296205 0.419052
C  0.784753 -0.96709 0.051975
C  -0.66944 -0.913103 0.568393
C  -1.364343 0.365167 -0.00438
C  3.02742 -0.116548 -0.160531
C  0.940795 1.532626 -0.211988
C  1.688004 -2.151879 0.480175
C  -2.882908 0.508539 0.428861
C  -0.532968 1.654366 0.261237
C  3.143699 -1.6401 0.211864
C  -1.455636 -2.176579 0.153291
C  1.761012 0.491823 1.956568
C  3.231801 0.175625 -1.664067
C  -3.611166 -0.816214 0.132412
C  -2.935962 -2.094002 0.595755
C  -3.527999 1.665493 -0.398461
C  -3.025706 0.80989 1.955169
C  4.622279 -0.292815 -2.168631
C  -5.070259 1.665912 -0.381809
C  -4.836592 -0.867554 -0.483944
C  5.712861 -0.218451 -1.057007
C  5.38402 0.744539 0.080039
C  -5.637676 0.3222 -0.834538
H  0.709406 -0.993351 -1.059589
H  -0.655905 -0.864345 1.677439
H  -1.38408 0.220882 -1.110896
H  0.942935 1.444606 -1.316807
H  1.493467 2.457777 0.04357
H  1.467172 -3.07414 -0.085429
H  1.542512 -2.384106 1.551689
H  -0.55339 1.905683 1.337625
H  -0.995905 2.508735 -0.266205
H  3.778718 -1.74732 1.109518
H  3.622372 -2.216888 -0.59848
H  -0.990735 -3.079429 0.593247
H  -1.406837 -2.290613 -0.949644
H  2.267173 -0.360282 2.441917
H  2.369374 1.386937 2.16422
H  0.778998 0.618612 2.440554
H  3.137578 1.26783 -1.807461
H  2.43319 -0.300665 -2.261301
H  -2.968124 -2.13202 1.705928
H  -3.502196 -2.972151 0.235234
H  -3.188712 1.576268 -1.450748
H  -3.160207 2.638308 -0.023377
H  -2.542174 0.038499 2.579862
H  -2.571896 1.784329 2.208222
H  -4.090494 0.849871 2.246735
H  4.920926 0.341369 -3.022247
H  4.568618 -1.328209 -2.551445
H  -5.482257 2.460964 -1.028271
H  -5.449734 1.864067 0.641642
H  -5.306956 -1.83519 -0.703988
H  6.695729 0.070626 -1.461621
H  5.839841 -1.215882 -0.592771
