program: Gaussian 09
title: 000250793
version: EM64L-G09RevD.01
frameworkgroup: C1[X(C22H32O3)]
method: RPBEPBE
basis: SDD
operation: Freq
keyword: #pfreq=noraman
keyword: PBEPBE/SDD
title: #p freq=noraman PBEPBE/SDD
converged: YES YES NO NO
title: Mulliken charges:
elementType: O O O C C C C C C C C C C C C C C C C C C C C C C H H H H H H H H H H H H H H H H H H H H H H H H H H H H H H H H
charge: -0.441432 -0.253575 -0.198924 0.382823 0.290529 -0.239732 -0.658082 -0.076455 -0.172899 -0.276375 -0.585653 -0.451507 -0.147542 -0.496164 0.364704 -0.537626 -0.862233 -0.517776 0.328733 -0.545391 -0.538222 -0.801129 -0.558486 -0.546248 0.148763 0.244132 0.222017 0.253208 0.201533 0.238659 0.213025 0.218370 0.230500 0.215726 0.205379 0.208014 0.205309 0.240122 0.234232 0.205008 0.237435 0.240628 0.195276 0.201428 0.212287 0.222497 0.236147 0.254502 0.218850 0.249054 0.214058 0.235735 0.337173 0.234787 0.238628 0.262780 0.263397
chargesum: 0.00000
title: Mulliken charges with hydrogens summed into heavy atoms:
elementType: O O O C C C C C C C C C C C C C C C C C C C C C C
charge: -0.104259 -0.253575 -0.198924 0.382823 0.290529 0.004401 -0.182857 0.125078 0.065760 -0.063351 -0.136782 -0.030402 0.060472 -0.050732 0.364704 -0.098385 -0.188894 -0.104061 0.328733 -0.086747 -0.064870 -0.102282 -0.085070 -0.020071 0.148763
polarizability: 2.73639987e+02 6.27089609e+00 2.12839089e+02 -5.08323241e+00 -7.40548940e-01 1.95433875e+02
1716.lowfreq: -19.1515 -6.1994 -0.0009 -0.0008 0.0006 7.1878 35.8724 45.8184 56.9137
frequency: 35.0643 45.5314 56.8649 85.3032 106.2109 114.5611 130.2487 132.6341 146.8248 160.0372 196.2999 207.0161 223.7699 232.5002 255.4201 261.5937 269.4926 292.7629 300.1736 303.2353 307.1128 332.6902 341.2230 357.9706 380.1152 392.8511 408.2751 411.7818 430.3590 450.0445 469.8323 489.7717 503.1060 511.1199 523.8070 553.6614 570.5087 595.3681 630.3113 638.8437 657.2516 683.3417 704.7288 726.3361 771.5882 790.9896 796.5484 804.1570 818.8117 822.9925 835.0879 858.3085 865.5167 866.2422 886.6615 903.1568 913.4214 919.3840 939.2783 940.1318 951.4205 967.1081 969.2745 979.7747 990.1733 1000.4531 1011.3617 1014.1283 1022.6263 1032.2697 1039.4964 1044.7191 1055.1655 1064.4659 1067.1622 1073.3336 1084.8399 1087.5573 1106.5328 1110.9487 1123.3300 1130.0473 1135.8404 1140.2576 1142.0267 1160.6382 1173.3503 1189.0249 1193.2849 1203.2783 1206.6196 1209.8887 1219.4588 1228.2091 1239.4880 1242.5796 1250.3443 1265.1323 1269.6882 1275.5200 1284.0732 1292.4527 1295.2045 1299.7389 1303.0597 1310.6978 1314.0787 1319.2330 1325.6263 1329.0294 1331.2961 1346.2231 1350.2315 1360.1855 1366.1123 1386.4470 1388.2945 1405.3266 1441.3875 1447.7599 1457.7024 1461.2149 1466.7519 1469.3352 1472.0622 1476.4638 1477.3280 1481.3913 1486.0372 1492.0752 1493.2745 1498.2633 1698.3710 2903.9356 2916.0974 2953.8430 2959.5793 2961.3991 2966.2480 2986.9192 2990.7533 3000.0998 3001.8994 3004.9593 3016.3376 3018.4799 3019.9553 3021.7390 3022.2904 3040.4050 3044.1817 3045.2484 3045.6313 3057.1724 3067.0417 3069.4905 3079.0683 3082.4184 3089.3964 3092.5263 3095.1287 3096.0960 3124.7961 3186.0864 3572.7369
redmass: 4.0267 4.5290 8.4130 3.1220 3.1007 1.2396 2.5925 2.9981 2.6120 2.9780 2.3799 1.5662 2.3379 2.8180 2.5492 1.8637 1.3924 3.4701 2.3957 2.5708 2.9393 2.5728 2.8350 3.0844 3.1958 3.2775 2.5291 2.7967 3.0179 3.0587 2.8777 3.0609 3.2339 2.7080 2.8770 3.1822 3.2844 3.4605 4.8752 2.6579 2.9811 2.7119 3.7868 3.9075 1.5785 2.3840 2.6770 2.0148 2.1004 2.1996 1.8236 2.6759 2.4419 3.0519 2.2008 1.7900 2.2552 1.7749 1.9699 1.9279 2.0810 2.0249 1.8858 3.0289 2.2049 2.1351 1.8123 2.2065 1.7375 1.6211 1.6841 1.8592 1.4195 1.8244 1.7368 2.5213 2.9099 2.5901 2.0746 1.8026 2.2493 2.0586 1.8545 1.9878 1.8835 2.0065 1.8128 1.5336 1.5909 1.5000 1.4971 1.8359 1.8073 1.5055 1.5712 1.6959 1.5236 1.9098 1.7187 1.4448 1.4315 1.4916 1.5014 1.5858 1.4773 1.3353 1.5615 1.4250 1.5904 1.3852 1.3958 1.4974 1.4912 1.4538 1.2457 1.3998 1.6540 1.1830 1.0812 1.0887 1.1750 1.1120 1.0819 1.0714 1.0799 1.0755 1.0651 1.0909 1.0669 1.0792 1.0813 1.0668 12.6335 1.0807 1.0802 1.0725 1.0434 1.0588 1.0703 1.0595 1.0603 1.0517 1.0469 1.0660 1.0642 1.0820 1.0635 1.0805 1.0863 1.0993 1.0965 1.0957 1.0981 1.1010 1.1004 1.0993 1.1004 1.1025 1.0568 1.0989 1.0984 1.1007 1.0928 1.1142 1.0658
irintensity: 0.2489 2.9364 2.7566 3.0891 2.1650 105.8830 0.4854 0.6651 2.1377 17.1654 0.4267 0.8752 0.0303 1.0855 0.3874 0.4366 0.6382 0.7771 5.8962 0.3458 4.7225 1.1177 1.4584 0.5724 0.4589 0.5863 0.0083 1.5049 0.7349 1.5652 0.3683 0.9939 2.7490 0.9380 2.3917 2.1041 0.3528 11.1047 15.6382 0.7628 3.3007 2.1274 4.4291 0.1448 0.2774 1.5815 10.6743 7.4363 1.7245 17.9123 1.8867 41.5113 12.3217 40.6699 0.7010 10.2094 13.6381 3.4502 9.7966 25.9567 21.2115 1.5727 17.3483 7.9681 5.1757 14.6470 15.0362 44.9224 10.6334 19.5645 13.3349 27.6490 1.0114 3.9450 0.9809 6.7348 109.2181 28.7215 25.6733 51.7608 16.3744 3.9081 25.8011 18.5291 28.8424 7.8702 2.2114 1.3436 21.7393 6.1124 5.5376 1.8843 4.4394 2.5515 2.2453 8.8973 0.9155 12.8205 2.7399 4.8925 3.8360 2.8084 1.5429 12.2391 1.5269 0.2056 2.2940 1.4625 9.3194 1.6169 1.1502 1.7623 0.4414 4.3874 9.1577 33.5242 13.9652 28.3588 20.5015 8.7189 4.7679 5.7579 7.1878 10.3523 7.5203 2.1994 4.9779 17.7984 4.6178 24.1751 5.7543 11.1781 410.9709 9.3588 17.4339 1.3846 15.1452 36.1661 69.1439 51.5298 18.6287 18.8019 34.8576 25.2310 7.9726 11.0446 47.1302 34.4802 30.1811 42.3463 3.5395 29.5309 87.4584 11.6049 9.0859 68.2692 24.2672 30.2172 23.0487 34.3568 16.4736 23.3459 19.4870 13.0976 3.8083
temp: 298.150 k
press: 1.00000 atm
elementType: 8 8 8 6 6 6 6 6 6 6 6 6 6 6 6 6 6 6 6 6 6 6 6 6 6 1 1 1 1 1 1 1 1 1 1 1 1 1 1 1 1 1 1 1 1 1 1 1 1 1 1 1 1 1 1 1 1
symmnumber: 1
zpe: 1303258.1 jmol-1
zpe.correction: 0.496385 hartree
zpe.thermalcorrener: 0.519384 hartree
zpe.thermalcorrenthalpy: 0.520328 hartree
zpe.thermalcorrgfe: 0.446524 hartree
zpe.sumelectzpe: -1081.264659 hartree
zpe.sumelectthermal: -1081.241659 hartree
zpe.sumelectthermalent: -1081.240715 hartree
zpe.sumelectthermalfe: -1081.314520 hartree
dipole: 3.3629 -1.5054 -3.3620
dipole: 4.9878
quadrupole: -193.3193 -155.7080 -146.5814
quadrupole: -14.5234 14.6100 -0.9440
quadrupole: -28.1164 9.4949 18.6215 -14.5234 14.6100 -0.9440
hfenergy: -1081.7610436 hartree
pointgroup: C01 [X(C22H32O3)]
dipole: 1.3189155 -0.4892719 -1.3681634 debye
polarizability: 273.3283116|7.5286677|213.0870625|-5.3826919|0.1874323|195.497577 unknown
InChI: InChI=1S/C22H32O3/c1-19-8-4-16-14(15(19)5-9-21(19)10-6-18(24)25-21)11-17(23)22-12-13(22)3-7-20(16,22)2/h13-17,23H,3-12H2,1-2H3
charge 0 multiplicity 1
57 atoms
O  3.462858 2.384765 1.042535
O  -4.220385 0.200735 0.603806
O  -5.908315 -1.391239 0.688624
C  3.631395 0.22971 -0.220285
C  2.725507 -0.838583 0.464916
C  4.276112 -0.41406 -1.469026
C  5.141068 -0.051066 -0.254058
C  1.230681 -0.604323 0.018037
C  0.774616 0.885533 0.161446
C  3.187654 1.685249 -0.24111
C  3.266029 -2.187958 -0.135404
C  3.794341 -1.863431 -1.56283
C  -0.683431 1.010188 -0.329217
C  1.705255 1.823279 -0.640572
C  -1.686666 0.083744 0.428531
C  0.233793 -1.574073 0.714852
C  2.875125 -0.842199 2.00989
C  -1.234624 -1.386647 0.246876
C  -3.030058 0.528366 -0.265195
C  -1.367879 2.402885 -0.309085
C  -2.898053 2.079646 -0.364806
C  -1.786595 0.419238 1.944145
C  -3.374197 -0.1781 -1.613497
C  -4.286071 -1.357318 -1.219899
C  -4.927366 -0.909597 0.098271
H  4.406057 0.163388 -2.390699
H  5.562437 -0.857615 0.354583
H  5.79144 0.825352 -0.337387
H  1.194825 -0.823627 -1.074932
H  0.815667 1.185293 1.230791
H  3.813719 2.251522 -0.955532
H  2.493438 -2.976634 -0.1437
H  4.092263 -2.564848 0.496169
H  4.592213 -2.563261 -1.874704
H  2.980667 -1.93643 -2.310283
H  -0.674077 0.667241 -1.390892
H  1.607291 1.589921 -1.722374
H  1.407184 2.878479 -0.500184
H  0.284397 -1.439776 1.811004
H  0.533959 -2.621851 0.521096
H  2.480936 -1.774894 2.452938
H  3.941068 -0.76426 2.291274
H  2.330886 -0.006692 2.493497
H  -1.300471 -1.675689 -0.821952
H  -1.891656 -2.074174 0.816208
H  -1.049385 3.034451 -1.156098
H  -1.109925 2.94943 0.617144
H  -3.442938 2.53674 0.478951
H  -3.366256 2.455288 -1.291315
H  -2.529019 -0.239104 2.426156
H  -0.820578 0.283171 2.45842
H  -2.114494 1.457384 2.121476
H  3.167461 1.807612 1.790772
H  -2.472885 -0.488604 -2.166212
H  -3.933516 0.525391 -2.255564
H  -3.721121 -2.288212 -1.031166
H  -5.072081 -1.589936 -1.955733
