program: Gaussian 09
title: 000250792
version: EM64L-G09RevD.01
frameworkgroup: C1[X(C22H32O3)]
method: RPBEPBE
basis: SDD
operation: Freq
keyword: #pfreq=noraman
keyword: PBEPBE/SDD
title: #p freq=noraman PBEPBE/SDD
converged: YES YES NO NO
title: Mulliken charges:
elementType: O O O C C C C C C C C C C C C C C C C C C C C C C H H H H H H H H H H H H H H H H H H H H H H H H H H H H H H H H
charge: -0.253800 -0.198013 -0.198233 0.365692 -0.162178 -0.119996 -0.112448 0.329483 0.408229 -0.517911 -0.549218 -0.541991 -0.054267 -0.540281 -0.506001 -0.476198 -0.804000 -0.557570 -0.513352 -0.862541 -0.599268 -0.543858 -0.546428 0.176780 0.148498 0.211090 0.241215 0.191001 0.201496 0.212572 0.224495 0.217659 0.222075 0.231376 0.209645 0.254704 0.219154 0.221766 0.201307 0.201540 0.207291 0.233595 0.250722 0.216666 0.235226 0.238425 0.219415 0.221977 0.228265 0.226294 0.223374 0.226277 0.240045 0.243772 0.229530 0.262872 0.264027
chargesum: 0.00000
title: Mulliken charges with hydrogens summed into heavy atoms:
elementType: O O O C C C C C C C C C C C C C C C C C C C C C C
charge: -0.253800 -0.198013 -0.198233 0.365692 0.048912 0.121219 0.078553 0.329483 0.408229 -0.103842 -0.107064 -0.088540 0.155378 -0.066424 -0.082928 -0.067367 -0.103016 -0.083918 -0.071961 -0.184608 -0.132945 -0.070557 -0.019529 0.176780 0.148498
polarizability: 2.87141367e+02 6.97747277e+00 2.16674971e+02 -6.09203214e+00 -1.03460564e+00 1.86809893e+02
1716.lowfreq: -3.4817 -0.0006 -0.0003 0.0001 7.7216 16.1160 32.1355 50.3769 57.0889
frequency: 32.0095 50.1634 57.0580 61.8893 91.1778 115.9598 129.7332 134.7417 142.3354 177.5353 195.7390 202.7920 217.9895 241.7753 245.9414 257.4780 274.0964 292.9751 300.0910 312.3905 319.2425 350.7724 357.8107 376.6011 396.9664 407.7429 417.0678 426.7026 439.3605 449.2798 486.4912 495.5302 503.8850 516.3027 525.3000 539.0070 550.3080 568.4575 611.8942 641.4548 669.5183 681.6496 720.7456 728.0948 766.9575 772.0163 793.6771 806.6553 810.9126 832.5700 842.7213 860.9073 864.3147 880.6984 911.3546 913.8628 925.9314 941.0295 945.8076 959.7394 968.5391 979.4916 987.1435 999.4675 1002.1619 1014.0879 1020.8117 1025.5524 1040.0670 1053.7058 1063.6830 1074.2730 1082.6049 1087.3073 1095.6835 1113.8990 1119.0593 1123.2183 1128.8903 1131.3845 1137.5580 1143.2510 1154.3515 1173.1006 1180.8216 1190.8632 1203.7788 1207.5828 1220.0155 1221.4744 1231.3880 1236.6805 1244.6548 1253.1545 1258.6510 1267.6974 1273.0058 1275.7109 1288.0382 1296.0400 1298.6036 1301.3360 1308.0852 1311.9168 1319.6701 1325.6752 1329.4576 1333.6911 1337.9144 1344.1352 1350.6364 1352.5955 1362.1754 1366.7656 1394.5695 1396.6516 1440.2313 1445.8985 1450.4991 1459.1531 1464.5816 1467.0220 1470.1580 1472.2802 1474.2256 1475.1777 1478.4030 1486.1647 1490.9785 1491.8082 1496.6328 1632.0923 1698.0008 2896.9692 2911.4307 2928.0081 2949.8965 2959.6969 2967.4275 2968.5659 2971.4587 2975.4018 2977.5179 2988.8831 2994.2810 2998.0922 3001.9356 3015.7248 3019.1654 3019.5879 3020.6762 3022.7257 3029.9299 3041.0576 3049.2761 3055.0740 3056.9991 3065.9916 3072.3888 3077.4121 3081.4300 3082.2974 3092.8163 3095.5346 3097.0436
redmass: 5.8250 4.1989 6.6188 5.3424 2.2444 1.9937 3.6190 1.3989 2.6773 2.0090 3.2952 1.9064 2.8595 2.2567 2.2818 2.4976 2.5216 2.9066 3.1711 2.7221 2.8218 2.7190 2.9235 2.7577 2.9729 3.5732 2.4568 2.8488 3.3995 2.7754 2.7721 2.9026 3.3553 2.4608 2.6254 2.8886 2.8887 2.7006 3.5600 4.9503 3.2584 2.9698 4.2339 2.5938 2.0048 1.5880 2.8326 2.4189 2.5614 1.7913 1.9367 3.5979 2.3047 1.7670 1.6982 1.9898 1.7527 1.9054 1.9283 1.9327 2.0842 2.8067 2.2351 1.9166 1.9995 2.2696 2.0400 1.8829 2.2651 1.8707 2.3788 2.0840 2.0328 3.2244 2.2235 1.9827 1.6127 2.2643 2.0871 2.1120 1.9905 1.6201 2.0236 1.7691 2.1864 1.5940 1.4779 1.8362 1.7576 1.6580 2.0456 1.4292 1.4115 1.4421 1.6440 1.5094 1.6115 1.4630 1.5191 1.4339 1.4230 1.4657 1.3511 1.3126 1.3991 1.3514 1.4396 1.4618 1.4122 1.4099 1.4579 1.4227 1.4160 1.5068 1.2148 1.1950 1.0866 1.0804 1.0805 1.0702 1.0861 1.0811 1.0850 1.0785 1.0763 1.0855 1.0867 1.0565 1.0694 1.0699 1.0630 9.3423 12.6372 1.0813 1.0794 1.0815 1.0655 1.0592 1.0628 1.0641 1.0625 1.0800 1.0636 1.0419 1.0557 1.0597 1.0404 1.0640 1.0838 1.0676 1.0946 1.0741 1.1005 1.0976 1.1005 1.1012 1.0961 1.0966 1.0972 1.1007 1.1028 1.0976 1.0989 1.0986 1.1004
irintensity: 3.7124 3.3153 1.1685 1.6647 0.2982 0.9986 2.0444 0.4591 3.3802 0.5842 0.3131 0.9483 0.2904 0.4994 0.2246 0.0789 1.2532 1.9485 0.9401 0.3473 0.9248 0.6169 0.4544 0.2250 2.6745 0.7072 0.7590 1.0288 1.1779 1.0257 2.3133 3.2388 5.4550 2.2565 0.6520 0.8296 0.3173 1.2271 5.3026 10.0362 6.3168 0.5520 0.7004 3.0061 5.6073 0.4844 8.7611 1.8827 0.6041 6.7593 1.2014 68.2810 15.6613 5.1427 2.6913 2.6537 2.6806 12.9838 34.3491 14.9187 2.1659 11.8840 2.4019 5.2424 1.6176 49.9591 2.9324 6.9766 17.1547 8.0766 1.8762 3.4043 9.7484 122.2547 3.1309 78.9928 26.5767 8.3730 6.9733 0.8196 34.8576 0.5455 8.4506 13.3071 28.0550 7.5484 5.6310 8.2564 6.7811 11.9459 2.7878 5.5090 1.4893 1.1918 13.5162 9.0129 0.0882 3.7706 3.4563 11.9348 5.9710 0.1334 2.8323 0.3836 0.8098 0.4694 0.6784 1.3385 2.4211 1.5023 0.4656 3.2832 0.1762 0.5170 16.6980 31.1254 17.1285 19.3823 13.2009 4.0166 13.5137 4.3990 18.0492 15.5249 3.4963 8.3432 10.2740 4.2343 6.5003 7.1564 14.4036 224.3536 407.7299 8.1937 20.8930 16.2390 22.6304 47.8739 2.3485 17.1441 51.0756 18.9391 37.9626 16.7206 19.6446 25.0969 31.0639 7.6845 15.1809 42.5858 49.6015 16.4080 51.2188 54.1556 39.7433 11.4135 29.4421 28.0992 36.8907 24.8564 38.2195 29.9929 31.0273 18.7518 21.4032
temp: 298.150 k
press: 1.00000 atm
elementType: 8 8 8 6 6 6 6 6 6 6 6 6 6 6 6 6 6 6 6 6 6 6 6 6 6 1 1 1 1 1 1 1 1 1 1 1 1 1 1 1 1 1 1 1 1 1 1 1 1 1 1 1 1 1 1 1 1
symmnumber: 1
zpe: 1306465.3 jmol-1
zpe.correction: 0.497606 hartree
zpe.thermalcorrener: 0.520420 hartree
zpe.thermalcorrenthalpy: 0.521364 hartree
zpe.thermalcorrgfe: 0.447467 hartree
zpe.sumelectzpe: -1081.302193 hartree
zpe.sumelectthermal: -1081.279379 hartree
zpe.sumelectthermalent: -1081.278435 hartree
zpe.sumelectthermalfe: -1081.352333 hartree
dipole: 0.9118 2.1443 -0.9583
dipole: 2.5195
quadrupole: -221.2047 -149.4526 -149.9608
quadrupole: -7.4183 28.8457 0.9263
quadrupole: -47.6653 24.0868 23.5786 -7.4183 28.8457 0.9263
hfenergy: -1081.7997997 hartree
pointgroup: C01 [X(C22H32O3)]
dipole: 0.3577545 -0.8558732 0.3493592 debye
polarizability: 287.1209263|-7.2325229|216.7227166|5.9311314|-0.0624452|186.7825881 unknown
InChI: InChI=1S/C22H32O3/c1-20-9-5-15(23)13-14(20)3-4-16-17(20)6-10-21(2)18(16)7-11-22(21)12-8-19(24)25-22/h14,16-18H,3-13H2,1-2H3
charge 0 multiplicity 1
57 atoms
O  -4.489328 0.098825 -0.555463
O  6.439363 0.759561 1.247076
O  -6.018737 1.834703 -0.365134
C  -1.956542 -0.054826 -0.393224
C  -1.048438 -1.177047 0.201628
C  0.411015 -1.117223 -0.293022
C  1.016223 0.282983 0.065003
C  -3.339043 -0.47493 0.236108
C  2.529329 0.41288 -0.367001
C  -1.366254 1.319534 0.008109
C  0.115082 1.445333 -0.443901
C  -1.8615 -2.480127 -0.025367
C  3.312295 -0.765276 0.319307
C  -3.355756 -2.02724 0.084647
C  1.256658 -2.262174 0.315464
C  2.748893 -2.152488 -0.061756
C  -2.079729 -0.136939 -1.941558
C  -3.620502 0.034192 1.684084
C  3.120008 1.746197 0.190275
C  2.674836 0.387169 -1.91395
C  4.846998 -0.689058 0.088384
C  4.657169 1.882042 0.006177
C  -4.414672 1.342366 1.495354
C  5.418187 0.660202 0.51439
C  -5.090369 1.174663 0.129793
H  -1.006513 -1.005011 1.302863
H  0.411947 -1.241627 -1.396103
H  1.01181 0.340471 1.180848
H  -1.404974 1.44336 1.109839
H  -1.954115 2.146802 -0.437609
H  0.156417 1.500494 -1.547826
H  0.505618 2.410236 -0.070147
H  -1.610209 -3.259545 0.714538
H  -1.648111 -2.901764 -1.025536
H  3.146343 -0.642039 1.414275
H  -3.928242 -2.288568 -0.821955
H  -3.870802 -2.501658 0.938092
H  0.853614 -3.240227 -0.011051
H  1.159658 -2.231102 1.422291
H  3.328753 -2.941173 0.457604
H  2.882715 -2.329777 -1.148289
H  -2.483816 -1.106423 -2.278477
H  -2.77115 0.642603 -2.303508
H  -1.105168 0.009865 -2.435884
H  -2.697434 0.16516 2.271644
H  -4.247358 -0.707777 2.210021
H  2.882715 1.814484 1.272195
H  2.638508 2.613575 -0.298553
H  2.19055 -0.495737 -2.365353
H  2.215819 1.285681 -2.364491
H  3.732814 0.37308 -2.230309
H  5.07024 -0.845355 -0.987728
H  5.367033 -1.486626 0.648904
H  5.042183 2.77948 0.521261
H  4.887037 1.999516 -1.07303
H  -3.762537 2.233671 1.451565
H  -5.177936 1.527008 2.267791
