program: Gaussian 09
title: 000250790
version: EM64L-G09RevD.01
frameworkgroup: C1[X(C22H30O3)]
method: RPBEPBE
basis: SDD
operation: Freq
keyword: #pfreq=noraman
keyword: PBEPBE/SDD
title: #p freq=noraman PBEPBE/SDD
converged: YES YES NO NO
title: Mulliken charges:
elementType: O O O C C C C C C C C C C C C C C C C C C C C C C H H H H H H H H H H H H H H H H H H H H H H H H H H H H H H
charge: -0.253094 -0.199520 -0.197329 0.228275 0.319108 -0.214582 -0.648660 -0.081736 -0.174322 -0.581073 -0.453512 -0.130025 0.358510 -0.000246 -0.575824 -0.539058 -0.516998 0.325261 -0.838342 -0.537132 -0.539055 -0.800596 -0.558281 -0.545691 0.149233 0.265115 0.230774 0.289199 0.202364 0.255722 0.220762 0.231733 0.221892 0.210801 0.206543 0.260048 0.237699 0.231800 0.205388 0.201663 0.214050 0.225465 0.232599 0.222710 0.224317 0.234863 0.255006 0.220708 0.235334 0.250358 0.216843 0.233938 0.239801 0.262834 0.264361
chargesum: 0.00000
title: Mulliken charges with hydrogens summed into heavy atoms:
elementType: O O O C C C C C C C C C C C C C C C C C C C C C C
charge: -0.253094 -0.199520 -0.197329 0.228275 0.319108 0.050532 -0.128687 0.120628 0.081400 -0.128577 -0.020819 0.076519 0.358510 -0.000246 -0.078077 -0.101870 -0.101285 0.325261 -0.157568 -0.077953 -0.063341 -0.098061 -0.084541 -0.018496 0.149233
polarizability: 2.76994287e+02 6.64473077e+00 2.18413672e+02 -2.53671902e+00 1.98052822e+00 1.87148183e+02
1716.lowfreq: -12.0582 -5.6422 -0.0006 -0.0003 0.0009 5.6276 37.5221 39.7666 57.0313
frequency: 37.3083 39.7061 57.0182 75.5133 84.4202 121.1305 135.7311 145.1932 155.3792 190.6824 201.9603 210.5382 231.7576 238.8845 255.0383 272.6893 292.0191 299.0583 302.7340 323.8972 331.0095 351.4567 357.9015 374.8925 388.7362 407.9891 415.8929 444.0586 464.8163 482.9778 500.2472 515.0600 525.3992 531.7032 552.6832 581.0244 607.7286 629.0823 635.4034 659.6887 665.2559 687.4684 720.6378 771.0111 780.8143 792.4932 795.6194 809.8458 828.3315 832.4326 856.3124 861.6638 864.9066 900.0440 902.5525 916.4316 920.9527 943.2757 953.9619 965.9092 968.7949 979.3050 993.3503 1006.8436 1014.4462 1017.8962 1020.3830 1031.9135 1041.4366 1057.8687 1061.5060 1069.2433 1072.3028 1081.2717 1084.1574 1103.9748 1111.5682 1117.2676 1123.8267 1132.2766 1135.1575 1140.0741 1150.2420 1170.8809 1179.3294 1187.6437 1196.1606 1206.9061 1211.4939 1216.7064 1226.1168 1240.6146 1252.3086 1259.0908 1269.2426 1274.7320 1281.7888 1289.4021 1294.7826 1298.0077 1302.3120 1309.3789 1311.6763 1314.5185 1318.7823 1322.4047 1336.8163 1337.7623 1349.7656 1359.7869 1366.3430 1394.8798 1397.0641 1437.5978 1443.3697 1443.9924 1458.2669 1465.1021 1467.7396 1472.1036 1475.1196 1476.8759 1479.4374 1483.0582 1485.6851 1492.1339 1497.1203 1594.3935 1698.5531 2899.7482 2914.4609 2942.4969 2961.7628 2978.6388 2982.9802 2987.6324 2995.0530 3000.2510 3004.8088 3005.8990 3017.1073 3020.0171 3020.7329 3023.8718 3040.0182 3050.3022 3054.4483 3057.7486 3065.2353 3071.6030 3074.7941 3079.0360 3082.3187 3096.4716 3097.3946 3097.9787 3099.3270 3138.5249 3200.9251
redmass: 3.9170 5.5443 8.3855 2.8305 3.7332 2.3870 3.9882 2.7765 2.8469 1.9855 1.5825 1.9567 2.3074 2.2085 2.0616 2.1824 3.6239 2.6781 2.8378 2.2275 3.1273 2.5845 3.4836 4.3888 2.4697 3.1409 2.7743 3.9621 2.8709 3.2336 3.7824 2.5710 2.9098 2.8906 3.2919 3.1566 3.2105 3.6207 3.2371 3.8564 3.2515 3.0141 4.0241 1.6488 2.8253 2.4667 2.7297 2.2659 2.0666 2.0712 2.8344 2.6120 1.9905 1.9031 1.6059 2.1462 1.7279 1.9827 1.8698 1.9177 2.2489 3.1914 2.1324 1.8201 2.3005 2.1318 1.6892 1.9871 1.6618 1.7462 1.7763 1.9246 1.7429 1.9410 3.0092 1.9962 2.2745 1.9899 2.3296 2.1550 1.8452 1.7548 2.0261 2.1745 1.5890 1.6812 1.5238 1.4448 1.7276 1.7560 1.7646 1.6394 1.5227 2.1484 1.7153 1.4300 1.4771 1.5959 1.9528 1.4737 1.4576 1.5903 1.4683 1.3176 1.4995 1.4420 1.4479 1.3031 1.4656 1.5287 2.4130 1.1938 1.2082 1.0845 1.2176 1.0891 1.0748 1.0803 1.0787 1.0782 1.0850 1.0677 1.0764 1.0535 1.0760 1.0791 1.0668 10.1443 12.6441 1.0805 1.0808 1.0674 1.0593 1.0548 1.0634 1.0593 1.0614 1.0599 1.0623 1.0416 1.0642 1.0645 1.0801 1.0798 1.0997 1.1005 1.0934 1.0996 1.1009 1.0989 1.0987 1.1009 1.1026 1.0563 1.0984 1.1005 1.0987 1.0925 1.1144
irintensity: 0.0573 4.0229 3.8516 0.7282 1.4030 0.8829 1.2193 3.9969 0.4007 0.7694 0.3257 0.0626 0.3817 0.5500 0.2161 1.0183 1.2089 0.6521 1.7486 0.4276 4.1630 0.7482 1.4279 0.6768 1.4158 0.7878 1.6661 0.5609 0.2571 0.4035 2.8608 2.3018 0.2143 3.1606 3.2143 0.4024 12.6151 12.9280 5.0220 1.2390 7.2755 0.4863 0.3718 0.2657 2.2006 4.2252 9.1919 8.6474 1.8165 4.0235 47.3123 48.3006 3.9806 3.6499 8.3905 14.9782 2.1372 30.4404 10.3049 10.9260 0.4232 12.9009 1.5091 9.7699 47.8699 4.9645 6.4810 1.9865 24.8871 8.0718 2.7375 1.2547 2.3178 14.8677 91.8016 42.6598 80.5582 14.3509 11.2609 12.7405 4.1759 42.2333 17.5655 22.1479 5.6203 9.8094 6.5208 3.6473 0.4594 2.7148 4.0273 3.4048 1.6260 0.6655 2.1186 3.1514 29.0018 21.1567 41.7290 7.7298 10.6452 8.9919 1.1183 0.2299 8.6497 0.7786 0.3789 0.5147 1.1336 2.7730 44.8447 8.5180 42.1086 8.5940 32.8152 10.3682 3.9415 4.4457 4.3005 16.5441 14.3026 2.8183 10.4177 0.5632 23.6647 9.5102 11.8381 171.0866 408.4859 12.2616 24.0585 7.0728 43.0909 0.2334 40.6148 45.1508 15.8160 28.3317 25.7474 34.1136 13.1164 18.8387 30.8211 28.6999 32.5285 33.9126 19.0283 12.2181 34.4663 32.2851 43.2389 27.1832 27.7202 18.7073 16.8135 21.9963 33.2610 11.7051 3.1606
temp: 298.150 k
press: 1.00000 atm
elementType: 8 8 8 6 6 6 6 6 6 6 6 6 6 6 6 6 6 6 6 6 6 6 6 6 6 1 1 1 1 1 1 1 1 1 1 1 1 1 1 1 1 1 1 1 1 1 1 1 1 1 1 1 1 1 1
symmnumber: 1
zpe: 1244847.6 jmol-1
zpe.correction: 0.474137 hartree
zpe.thermalcorrener: 0.496421 hartree
zpe.thermalcorrenthalpy: 0.497365 hartree
zpe.thermalcorrgfe: 0.424678 hartree
zpe.sumelectzpe: -1080.100008 hartree
zpe.sumelectthermal: -1080.077725 hartree
zpe.sumelectthermalent: -1080.076780 hartree
zpe.sumelectthermalfe: -1080.149467 hartree
dipole: 2.2653 -1.9514 -3.0046
dipole: 4.2388
quadrupole: -197.1876 -155.9498 -145.0243
quadrupole: -24.6690 13.7149 1.6987
quadrupole: -31.1337 10.1041 21.0296 -24.6690 13.7149 1.6987
hfenergy: -1080.5741454 hartree
pointgroup: C01 [X(C22H30O3)]
dipole: -0.8766641 0.7918757 -1.1770782 debye
polarizability: 277.0011796|6.3291815|218.4086478|3.465088|-1.4079195|187.1463135 unknown
InChI: InChI=1S/C22H30O3/c1-19-8-4-16-14(15(19)5-9-21(19)10-6-18(24)25-21)11-17(23)22-12-13(22)3-7-20(16,22)2/h13-16H,3-12H2,1-2H3
charge 0 multiplicity 1
55 atoms
O  4.29247 -0.204233 0.564854
O  -4.004086 -2.51541 -0.246784
O  6.010439 1.350739 0.421042
C  -3.584352 -0.1374 -0.079145
C  -2.627467 0.944043 0.494019
C  -4.340511 0.475138 -1.316997
C  -5.09221 0.153971 -0.032219
C  -1.157597 0.646567 0.010167
C  -0.72382 -0.825625 0.30748
C  -3.174447 2.274358 -0.145379
C  -3.812718 1.89599 -1.511673
C  0.721787 -1.041025 -0.189432
C  1.758868 -0.056504 0.435101
C  -3.164634 -1.568255 -0.193071
C  -1.67249 -1.840601 -0.370807
C  -0.121785 1.663828 0.569339
C  1.330715 1.391363 0.09198
C  3.075926 -0.608295 -0.231377
C  -2.729024 1.006308 2.040822
C  1.377506 -2.437525 -0.014805
C  2.912155 -2.157904 -0.143684
C  1.886491 -0.214691 1.977269
C  3.398442 -0.073119 -1.661354
C  4.33733 1.127889 -1.430457
C  5.006301 0.824076 -0.08526
H  -4.527612 -0.157207 -2.190755
H  -5.447881 0.976382 0.596005
H  -5.729933 -0.734483 -0.04168
H  -1.158064 0.751595 -1.100695
H  -0.755928 -0.998769 1.402323
H  -2.385946 3.039279 -0.251598
H  -3.942332 2.708713 0.521418
H  -4.609161 2.606175 -1.804338
H  -3.054883 1.90088 -2.318499
H  0.698331 -0.82693 -1.284618
H  -1.471284 -2.874625 -0.03924
H  -1.487425 -1.82239 -1.468559
H  -0.14811 1.652433 1.674287
H  -0.404525 2.689907 0.266252
H  1.374364 1.554727 -1.004342
H  2.013231 2.12626 0.563222
H  -2.229707 1.904261 2.446985
H  -3.789115 1.046792 2.349099
H  -2.281898 0.119816 2.526093
H  1.025356 -3.161029 -0.770046
H  1.134264 -2.859952 0.977873
H  3.468235 -2.524247 0.73629
H  3.349411 -2.651252 -1.029139
H  2.193563 -1.232895 2.268917
H  2.656163 0.475298 2.362459
H  0.936176 0.008621 2.48939
H  2.489114 0.186012 -2.227573
H  3.931462 -0.857669 -2.227295
H  3.790043 2.083349 -1.335622
H  5.1066 1.260967 -2.207447
