program: Gaussian 09
title: 000250787
version: EM64L-G09RevD.01
frameworkgroup: C1[X(C21H30O2)]
method: RPBEPBE
basis: SDD
operation: Freq
keyword: #pfreq=noraman
keyword: PBEPBE/SDD
title: #p freq=noraman PBEPBE/SDD
converged: YES YES NO NO
title: Mulliken charges:
elementType: O O C C C C C C C C C C C C C C C C C C C C C H H H H H H H H H H H H H H H H H H H H H H H H H H H H H H
charge: -0.254335 -0.200114 0.359857 -0.140043 -0.137786 0.334749 -0.084447 -0.518023 -0.547376 -0.537746 -0.530942 -0.230404 -0.483727 -0.559100 -0.805585 -0.640452 0.495106 -0.462479 -0.546800 0.148576 -0.444540 -0.458423 -0.429582 0.212896 0.234658 0.218560 0.201090 0.210502 0.219739 0.232170 0.254754 0.217515 0.213239 0.226260 0.216831 0.218039 0.212962 0.235907 0.237631 0.216765 0.231251 0.252062 0.206050 0.221374 0.196664 0.218254 0.263152 0.262976 0.203212 0.205468 0.214330 0.208443 0.210863
chargesum: 0.00000
title: Mulliken charges with hydrogens summed into heavy atoms:
elementType: O O C C C C C C C C C C C C C C C C C C C C C
charge: -0.254335 -0.200114 0.359857 0.072853 0.096872 0.334749 0.134114 -0.106431 -0.095467 -0.065478 -0.091442 -0.013573 -0.052727 -0.085562 -0.105507 -0.213029 0.495106 -0.047561 -0.020672 0.148576 -0.035860 -0.244093 -0.010276
polarizability: 2.78158928e+02 4.13744602e+00 2.07469329e+02 -9.37501587e+00 7.36611842e-02 1.71735470e+02
1716.lowfreq: -14.4490 -2.7209 -0.0006 0.0006 0.0007 8.6274 36.3839 49.9328 57.8329
frequency: 35.9822 49.9215 57.8263 79.3254 101.7776 133.7453 144.1100 159.1702 191.5130 198.7536 208.4397 238.8020 259.2294 268.2760 287.8563 293.1697 310.9373 312.3963 348.5935 360.1148 374.2883 380.5440 415.8516 426.0421 430.1030 465.2958 475.0217 496.7186 508.8745 520.6187 544.1334 556.6160 565.1892 605.3417 637.8802 664.0202 687.3497 720.8762 762.3033 772.5055 792.7832 810.3720 814.5027 831.6183 837.3979 848.5108 861.2669 865.0433 881.7859 896.4147 925.9724 933.5650 948.5908 957.5279 967.7893 979.4616 990.1552 1002.6924 1013.4157 1015.3991 1027.8436 1032.1652 1050.5237 1060.4287 1066.3175 1073.6551 1083.9944 1090.2280 1104.1530 1106.2666 1117.8200 1119.2326 1129.9324 1137.4448 1144.3652 1160.9468 1164.2775 1167.9117 1186.1702 1191.2759 1205.0517 1217.1952 1222.4628 1226.1524 1235.0406 1244.3026 1250.1452 1254.5869 1274.2610 1280.0163 1286.2207 1287.3565 1295.6743 1299.5656 1303.7863 1311.3114 1318.3201 1324.4171 1326.6597 1328.3640 1333.0914 1337.5669 1341.6897 1344.7661 1353.7946 1364.6039 1366.5387 1392.9243 1445.9460 1454.9569 1458.6663 1459.6654 1464.9146 1467.2186 1468.6108 1472.6822 1472.8692 1475.3974 1478.6185 1489.7837 1492.7235 1682.4133 1696.9700 2896.1604 2908.8892 2917.5443 2937.7464 2946.6285 2947.4755 2959.9735 2962.6411 2963.9588 2976.1648 2978.4891 2998.6300 3002.3015 3005.8514 3015.3999 3018.8942 3019.1109 3022.7838 3025.1221 3029.8235 3035.5196 3040.7294 3043.3526 3054.9168 3077.7417 3081.2787 3084.1413 3093.0953 3097.5408 3097.8121
redmass: 3.9576 3.8723 7.2091 2.9144 2.2233 3.6196 2.0919 2.2270 1.8452 2.5159 2.9738 2.6949 2.1976 2.5664 3.0447 2.7518 2.1959 2.4529 2.5357 2.3722 3.3474 3.3063 3.0144 2.8331 3.5271 3.9070 2.3951 3.8365 3.4635 2.8314 2.4317 2.8397 2.9376 3.0609 4.7951 2.4233 2.7906 4.1897 2.5627 1.5978 2.8560 1.3858 2.1086 1.8194 1.7600 1.8469 4.2707 2.2368 2.1299 1.6462 1.7918 1.8628 2.1134 2.2967 2.0085 3.1761 2.1480 2.0923 2.3265 1.9336 1.9690 2.2696 2.1349 1.7431 2.0471 2.3868 2.4570 3.2858 1.8731 1.8456 1.4667 1.6536 2.2219 1.9205 1.6044 1.6578 2.1067 2.1409 1.5975 1.4486 1.4306 1.7236 1.4393 1.5856 1.3282 1.6537 1.4443 1.3048 1.4639 1.3978 1.3229 1.4555 1.3219 1.5468 1.3281 1.3374 1.4383 1.3868 1.4005 1.4003 1.5854 1.4300 1.6244 1.5518 1.4578 1.6276 1.5229 1.1937 1.0802 1.0915 1.0884 1.0701 1.0912 1.0806 1.0853 1.0722 1.0905 1.0836 1.0875 1.0723 1.0711 7.5809 12.6230 1.0790 1.0800 1.0822 1.0665 1.0819 1.0647 1.0592 1.0638 1.0631 1.0630 1.0644 1.0590 1.0380 1.0922 1.0644 1.0889 1.0647 1.0706 1.0933 1.1009 1.0970 1.1025 1.0984 1.1013 1.1008 1.1027 1.0904 1.0987 1.0991 1.1004
irintensity: 0.6545 1.6513 2.0632 0.5087 0.5677 1.8550 1.8355 0.9463 1.5641 0.5710 0.1046 0.0926 0.3541 0.2256 1.2957 3.1326 0.2194 0.9183 0.6017 0.6798 0.4780 0.5645 1.9905 0.2244 0.1810 1.4402 0.3029 1.8828 1.9902 2.1634 1.6145 0.9006 1.5206 2.9482 7.3782 10.1941 4.3388 0.8555 1.4192 0.3977 4.8379 12.7659 1.3822 6.8523 4.2642 2.3704 81.7354 10.3340 7.4340 5.7107 1.9732 12.6604 34.2269 2.9310 19.9031 6.8099 3.4295 0.8951 34.1334 13.4217 0.5904 19.6633 3.1096 1.2826 2.1742 7.6024 42.3265 67.1683 5.9845 53.0462 11.5535 49.9903 5.8263 40.0098 2.7934 1.2916 1.4992 10.8471 14.8445 5.5334 4.1285 0.2100 1.3651 2.1366 0.4421 6.2005 1.4539 1.2957 2.9327 1.6705 2.6257 0.3112 8.1602 10.4962 2.8878 0.2696 0.7503 1.6109 0.8805 2.1785 0.9462 1.1248 0.7783 0.5219 1.2867 1.0123 1.5000 24.7441 19.3841 12.9375 6.5145 3.7187 6.8150 4.5200 8.2198 15.3309 6.8311 7.3242 9.4465 8.2985 10.8923 2.8793 412.6472 10.4490 8.1281 16.0577 27.5200 29.1937 48.7825 46.7303 16.2694 65.9140 39.9558 17.0884 26.3776 27.1237 61.2374 7.1509 17.5767 46.4607 23.5987 50.7693 43.6472 47.4704 111.0692 18.6640 11.8308 25.9803 34.5216 37.6697 23.8292 31.2917 15.0292
temp: 298.150 k
press: 1.00000 atm
elementType: 8 8 6 6 6 6 6 6 6 6 6 6 6 6 6 6 6 6 6 6 6 6 6 1 1 1 1 1 1 1 1 1 1 1 1 1 1 1 1 1 1 1 1 1 1 1 1 1 1 1 1 1 1
symmnumber: 1
zpe: 1223096.4 jmol-1
zpe.correction: 0.465853 hartree
zpe.thermalcorrener: 0.486197 hartree
zpe.thermalcorrenthalpy: 0.487142 hartree
zpe.thermalcorrgfe: 0.418426 hartree
zpe.sumelectzpe: -966.925601 hartree
zpe.sumelectthermal: -966.905256 hartree
zpe.sumelectthermalent: -966.904312 hartree
zpe.sumelectthermalfe: -966.973028 hartree
dipole: 4.2356 1.3589 -2.7190
dipole: 5.2135
quadrupole: -172.9332 -138.2512 -137.1277
quadrupole: -11.8041 13.9326 2.8057
quadrupole: -23.4958 11.1862 12.3096 -11.8041 13.9326 2.8057
hfenergy: -967.3914535 hartree
pointgroup: C01 [X(C21H30O2)]
dipole: 1.6555491 -0.6415365 1.0270164 debye
polarizability: 277.9548242|-5.0791638|207.0623557|10.0713397|3.7092851|172.3465464 unknown
InChI: InChI=1S/C21H30O2/c1-20-11-8-16-15-5-3-2-4-14(15)6-7-17(16)18(20)9-12-21(20)13-10-19(22)23-21/h4,15-18H,2-3,5-13H2,1H3
charge 0 multiplicity 1
53 atoms
O  -4.056693 0.095512 -0.635352
O  -5.641322 1.76571 -0.33848
C  -1.519504 -0.005024 -0.447878
C  -0.591323 -1.146646 0.078479
C  0.867678 -1.01067 -0.396235
C  -2.899242 -0.503198 0.128913
C  1.43695 0.362167 0.085641
C  -0.970099 1.350795 0.062457
C  -1.36938 -2.449946 -0.248313
C  -2.875603 -2.040009 -0.134554
C  0.520087 1.544889 -0.334746
C  2.914147 0.57808 -0.391203
C  1.760461 -2.16689 0.107078
C  -3.211345 -0.105609 1.605034
C  -1.618677 0.024056 -1.99934
C  3.216795 -1.99041 -0.385408
C  3.78655 -0.627054 -0.022699
C  3.502236 1.90699 0.156854
C  -4.035991 1.192683 1.497627
C  -4.696346 1.100768 0.117676
C  5.039772 1.963224 0.036795
C  5.007204 -0.501296 0.568852
C  5.684091 0.825787 0.859608
H  -0.565643 -1.051328 1.189515
H  0.89043 -1.030465 -1.508288
H  1.455909 0.324663 1.200162
H  -1.035865 1.395826 1.168954
H  -1.567094 2.194972 -0.337362
H  -1.111113 -3.269226 0.444781
H  -1.130003 -2.80231 -1.269004
H  -3.424755 -2.245667 -1.069565
H  -3.395111 -2.587067 0.671466
H  0.604156 1.696395 -1.429927
H  0.882757 2.479248 0.132751
H  2.879545 0.641672 -1.504884
H  1.362834 -3.138301 -0.245874
H  1.742537 -2.189204 1.216774
H  -2.298802 0.006733 2.212381
H  -3.825003 -0.89832 2.069091
H  -0.653582 0.287691 -2.46166
H  -1.936718 -0.946116 -2.41768
H  -2.366499 0.772055 -2.312089
H  3.217661 -2.100669 -1.492461
H  3.864504 -2.79324 0.014631
H  3.223205 2.007792 1.227175
H  3.051892 2.766104 -0.374183
H  -3.403275 2.098515 1.516791
H  -4.808396 1.30848 2.274252
H  5.415524 2.947662 0.376226
H  5.330563 1.852551 -1.027116
H  5.563424 -1.414871 0.828244
H  5.618677 1.060992 1.944099
H  6.76609 0.749026 0.632102
