program: Gaussian 09
title: 000250784
version: EM64L-G09RevD.01
frameworkgroup: C1[X(C19H28O3)]
method: RPBEPBE
basis: SDD
operation: Freq
keyword: #pfreq=noraman
keyword: PBEPBE/SDD
title: #p freq=noraman PBEPBE/SDD
converged: YES YES NO NO
title: Mulliken charges:
elementType: O O O C C C C C C C C C C C C C C C C C C C H H H H H H H H H H H H H H H H H H H H H H H H H H H H
charge: -0.468466 -0.441539 -0.233787 -0.175780 -0.161357 0.379744 0.247910 0.223147 -0.497654 -0.602680 -0.193663 -0.535706 -0.473060 -0.461601 0.587917 -0.648402 -0.802071 -0.561486 -0.823913 -0.530094 -0.580356 0.181948 0.272621 0.225472 0.213551 0.195659 0.235609 0.210256 0.206600 0.215723 0.222049 0.224598 0.249713 0.238135 0.217933 0.216994 0.233769 0.235369 0.230864 0.207848 0.217292 0.231145 0.225530 0.229968 0.239394 0.334429 0.213742 0.241802 0.253646 0.331240
chargesum: 0.00000
title: Mulliken charges with hydrogens summed into heavy atoms:
elementType: O O O C C C C C C C C C C C C C C C C C C C
charge: -0.134038 -0.110300 -0.233787 0.096841 0.064115 0.379744 0.247910 0.223147 -0.088444 -0.156816 0.012938 -0.097934 0.001250 -0.005533 0.587917 -0.197640 -0.127990 -0.113049 -0.129020 -0.074550 -0.326710 0.181948
polarizability: 2.61645489e+02 -3.44888463e+00 1.89778788e+02 -1.53794601e+01 1.82264030e+00 1.66365497e+02
1716.lowfreq: -15.4542 0.0008 0.0009 0.0011 3.6333 7.1273 38.9955 48.6188 76.7794
frequency: 38.9798 48.5573 76.7785 116.7496 123.7400 142.8541 162.3237 181.3423 197.3568 212.2098 223.6074 233.4347 247.8618 268.9861 271.2747 282.5322 285.8295 292.5942 294.6805 318.9284 329.3467 358.0350 363.2007 371.5846 398.7302 412.7545 432.2984 449.2320 480.0049 491.3173 510.9394 526.5381 539.2544 550.9968 578.4660 601.9172 629.3244 641.9435 670.1794 694.6013 715.4089 737.1211 799.0857 814.4877 833.8599 836.0590 860.3499 884.4925 885.5944 910.6361 917.3333 924.8015 935.7274 950.0723 965.7646 983.0749 988.0449 1001.4139 1007.4253 1017.4912 1023.5672 1031.6459 1038.7828 1060.9261 1064.6202 1072.1270 1093.0075 1106.7464 1110.8037 1125.5158 1128.9717 1140.5970 1160.0643 1168.3958 1179.6923 1196.9440 1198.8754 1208.8103 1209.5157 1212.2538 1232.8586 1237.1265 1240.9749 1263.1694 1277.3044 1278.8689 1284.5234 1289.4368 1297.5223 1312.4343 1325.4211 1327.6669 1329.6888 1339.3433 1343.1331 1346.8874 1348.4690 1353.9532 1363.4848 1379.9827 1389.9508 1399.0949 1438.6236 1453.8574 1461.7252 1465.3857 1466.5019 1468.8677 1475.7759 1476.7674 1481.4681 1487.8556 1491.6386 1493.4259 1585.9588 1631.1595 2928.8784 2958.3660 2960.2442 2971.3619 2980.3717 2982.0334 2985.3673 2988.1696 2988.7390 2990.6243 2993.6132 2996.3583 3015.5669 3021.6763 3036.5815 3046.3024 3047.8424 3050.8997 3062.1378 3063.7429 3074.9964 3080.6944 3082.7326 3087.9584 3097.4473 3120.8869 3557.5233 3564.0531
redmass: 6.5201 3.7247 4.5978 2.1304 4.0198 1.9512 2.8620 2.3584 2.1094 2.2314 3.5250 2.5393 2.1895 1.8412 2.1845 2.8410 1.4475 2.1031 1.7326 1.6095 2.9014 2.9810 2.1162 2.8662 3.3793 2.6504 2.8670 3.3818 4.3289 3.5400 2.7800 2.8806 3.2476 4.0514 2.4413 2.9979 3.1304 3.7320 3.3820 3.6725 2.3427 2.2706 2.2218 2.1268 2.0858 1.7333 2.2228 1.5994 2.0631 1.9006 2.2316 2.3072 1.8788 2.1287 2.3872 1.9451 2.2654 1.7979 2.3079 2.4733 2.0312 2.0188 2.2682 2.5565 2.3365 1.8752 2.0733 2.2885 2.5474 1.6701 1.9519 1.7099 1.9189 1.6638 1.4627 1.4662 1.7507 2.0780 1.4854 1.4657 1.2534 1.6253 1.4677 1.3771 1.9576 1.7248 1.3715 1.4854 1.3733 1.5541 1.4975 1.5401 1.4184 1.3853 1.7034 1.4060 1.7996 1.4102 1.4976 1.3314 1.2083 1.2243 1.0862 1.0796 1.0885 1.0810 1.0904 1.0720 1.0850 1.0721 1.0582 1.0703 1.0691 1.0647 9.9086 7.8365 1.0847 1.0650 1.0741 1.0634 1.0798 1.0621 1.0539 1.0609 1.0508 1.0577 1.0410 1.0604 1.1009 1.0621 1.0973 1.0971 1.0969 1.1003 1.1031 1.0980 1.0992 1.0982 1.1025 1.0992 1.0977 1.0910 1.0660 1.0660
irintensity: 3.4935 0.8066 1.9705 1.1164 0.9090 3.7444 18.7863 2.1391 0.0412 1.3710 3.9228 18.9991 21.8972 16.4205 0.4443 2.7067 87.2641 26.7883 85.6168 70.8862 0.1502 4.3208 6.3607 2.9923 7.5447 6.0614 3.0395 6.0840 6.3571 2.1987 10.5860 4.4860 4.1275 2.2079 0.2323 1.6978 4.4326 0.5896 5.1401 0.7004 0.2978 6.0659 1.8772 3.8028 1.8225 6.0917 3.0329 50.7047 22.9882 3.4504 9.8302 7.3149 5.0703 6.8066 35.9041 7.3269 18.1388 8.0842 64.6190 4.6910 7.4828 5.1298 22.7743 6.5150 5.7120 13.7688 10.2107 0.9159 2.2297 3.0376 7.0525 14.6623 10.1339 15.4486 15.4858 11.8372 4.8309 4.8461 1.9685 18.2519 24.4915 21.4831 7.5746 2.4900 34.3223 2.8318 2.1292 3.2319 14.1894 21.4526 6.9488 9.0173 7.7182 4.6592 2.0633 3.9556 3.9395 3.5365 1.0546 6.3681 11.8717 25.8319 13.6434 2.3122 9.4849 14.9427 12.1887 7.2405 16.0335 0.6258 12.1598 4.3729 14.3021 6.6224 178.2825 206.6542 39.9678 26.9417 20.2007 23.4544 5.7136 13.6886 29.3808 36.7697 20.2302 29.1374 50.1482 33.9646 23.9447 35.5575 26.8943 36.7081 32.1609 22.6167 31.9650 22.9442 29.4742 29.0597 57.5685 20.5918 32.1645 9.6269 5.3022 3.0080
temp: 298.150 k
press: 1.00000 atm
elementType: 8 8 8 6 6 6 6 6 6 6 6 6 6 6 6 6 6 6 6 6 6 6 1 1 1 1 1 1 1 1 1 1 1 1 1 1 1 1 1 1 1 1 1 1 1 1 1 1 1 1
symmnumber: 1
zpe: 1137211.2 jmol-1
zpe.correction: 0.433141 hartree
zpe.thermalcorrener: 0.454011 hartree
zpe.thermalcorrenthalpy: 0.454956 hartree
zpe.thermalcorrgfe: 0.386357 hartree
zpe.sumelectzpe: -964.769455 hartree
zpe.sumelectthermal: -964.748585 hartree
zpe.sumelectthermalent: -964.747641 hartree
zpe.sumelectthermalfe: -964.816240 hartree
dipole: -3.1807 -1.9809 2.0289
dipole: 4.2611
quadrupole: -183.0119 -121.0067 -133.1973
quadrupole: -0.5667 12.4325 3.8764
quadrupole: -37.2733 24.7320 12.5414 -0.5667 12.4325 3.8764
hfenergy: -965.2025963 hartree
pointgroup: C01 [X(C19H28O3)]
dipole: -1.2511817 -0.7732027 0.8045041 debye
polarizability: 261.5952369|-3.6206758|189.8077499|-15.4863383|1.7078324|166.3867883 unknown
InChI: InChI=1S/C19H28O3/c1-17-9-10-19(22)15(14(17)5-6-16(17)21)4-3-12-11-13(20)7-8-18(12,19)2/h11,14-16,21-22H,3-10H2,1-2H3
charge 0 multiplicity 1
50 atoms
O  0.510443 -0.418858 -1.405196
O  -5.241663 -1.042501 -0.427123
O  5.476085 0.019436 -1.210561
C  -1.933336 0.700774 -0.379257
C  -0.586706 0.816936 0.359665
C  -2.760786 -0.545098 0.06321
C  0.27192 -0.465855 0.065209
C  1.687482 -0.40115 0.809347
C  -1.934796 -1.806584 -0.276799
C  -0.530655 -1.758124 0.391101
C  -4.030033 -0.308623 -0.818923
C  -2.946836 1.874203 -0.297857
C  0.182409 2.107078 0.003987
C  -4.314045 1.213885 -0.68702
C  2.345266 0.940617 0.450598
C  1.536595 2.181945 0.765189
C  -3.164366 -0.535783 1.559606
C  2.638023 -1.597834 0.454957
C  1.488671 -0.462754 2.361463
C  3.541808 -1.422998 -0.785822
C  3.564995 1.041082 -0.168203
C  4.306953 -0.101019 -0.730673
H  -1.685806 0.55012 -1.451456
H  -0.792873 0.836777 1.449347
H  -1.812978 -1.8743 -1.377003
H  -2.451702 -2.72962 0.057593
H  -0.644522 -1.855032 1.486017
H  0.04655 -2.645717 0.06239
H  -3.765557 -0.562434 -1.871138
H  -2.676145 2.699423 -0.979407
H  -2.986157 2.298339 0.723893
H  -0.432976 2.989065 0.262791
H  0.372115 2.133347 -1.084921
H  -5.078589 1.355499 0.097404
H  -4.728583 1.625212 -1.623102
H  1.329906 2.257024 1.852302
H  2.095262 3.088893 0.472834
H  -3.663835 0.405165 1.847955
H  -3.882413 -1.35183 1.756218
H  -2.297661 -0.674042 2.229765
H  2.05502 -2.534255 0.373168
H  3.310392 -1.744187 1.323013
H  0.697516 0.21059 2.729928
H  1.235048 -1.491299 2.675252
H  2.430598 -0.184734 2.867981
H  0.883741 -1.290944 -1.688834
H  2.960356 -1.415268 -1.729237
H  4.26843 -2.25132 -0.863281
H  4.019597 2.026735 -0.332536
H  -5.131565 -1.998482 -0.662034
