program: Gaussian 09
title: 000250782
version: EM64L-G09RevD.01
frameworkgroup: C1[X(C19H16N4O2)]
method: RPBEPBE
basis: SDD
operation: Freq
keyword: #p
keyword: freq=noraman
keyword: PBEPBE/SDD
title: #p freq=noraman PBEPBE/SDD
converged: YES YES NO NO
title: Mulliken charges:
elementType: O O N N N N C C C C C C C C C C C C C C C C C C C H H H H H H H H H H H H H H H H
charge: -0.283476 -0.269244 -0.140579 -0.212751 -0.369005 -0.100062 0.116487 0.101729 -0.572617 0.257093 -0.566802 0.176966 0.489926 0.493559 -0.210913 -0.382108 -0.383084 -0.384233 -0.381195 -0.229907 -0.233232 -0.234760 -0.232833 -0.235088 -0.236608 0.244150 0.253276 0.253402 0.250781 0.342217 0.271976 0.262967 0.261927 0.265507 0.264938 0.225550 0.224322 0.223838 0.223479 0.227931 0.226475
chargesum: 0.00000
title: Mulliken charges with hydrogens summed into heavy atoms:
elementType: O O N N N N C C C C C C C C C C C C C C C C C C C
charge: -0.283476 -0.269244 -0.140579 -0.212751 -0.026788 -0.100062 0.116487 0.101729 -0.075191 0.257093 -0.062619 0.176966 0.489926 0.493559 0.061062 -0.119142 -0.121156 -0.118726 -0.116258 -0.004357 -0.008910 -0.010921 -0.009355 -0.007157 -0.010133
polarizability: 2.36554669e+02 -9.10585543e+00 2.57948175e+02 4.06674623e+00 -1.42381848e+01 1.78733471e+02
1716.lowfreq: -8.3979 -0.0005 0.0005 0.0006 3.2350 7.3755 16.6899 21.0698 34.0807
frequency: 16.5569 21.0515 34.0575 41.7953 47.9487 57.1532 94.5720 115.0469 159.6244 179.3453 193.1939 207.4067 219.0849 241.5540 299.1075 319.8237 365.9218 371.1789 394.9331 405.0712 405.5746 417.8925 434.4168 447.9374 485.9544 513.2854 549.2688 591.4001 601.9214 616.3066 617.5488 617.8161 659.7036 663.1238 687.8032 703.9420 706.7249 713.0545 743.7970 744.5203 760.3971 776.0244 810.3369 818.6555 822.2820 861.3822 863.5947 880.1186 913.4789 924.9634 940.3587 943.5562 966.1574 986.0905 987.5333 989.9302 990.1872 1000.0124 1000.6644 1024.2535 1027.6970 1028.7861 1071.3749 1075.6099 1095.9094 1101.9442 1114.9168 1172.4734 1173.2701 1189.5034 1190.9053 1194.1515 1212.0758 1215.0917 1223.4206 1261.8287 1284.0833 1302.2819 1335.0368 1341.4949 1353.0475 1361.1165 1376.4047 1380.5349 1385.3461 1387.3201 1406.4022 1444.4543 1445.1299 1453.9517 1458.8132 1483.8093 1484.9648 1510.2334 1568.1521 1593.6859 1594.8834 1605.6948 1613.4094 1614.2891 1650.1946 3044.4991 3050.3219 3107.8064 3113.3131 3121.8728 3122.3479 3130.1850 3131.2108 3140.9634 3143.1942 3149.9664 3151.8792 3163.7917 3164.0398 3249.9435 3587.9385
redmass: 5.0994 4.5945 4.3893 5.8125 5.2635 5.0682 7.8536 9.1564 6.2238 8.2656 4.7402 5.1055 5.4160 5.7243 6.3093 8.0609 4.1669 3.4401 2.6745 2.8328 2.8497 3.6427 4.3418 4.0612 6.2309 5.4543 6.1380 4.6104 5.7833 4.0813 6.1700 6.2466 4.7662 2.1884 1.9376 3.2780 1.8407 2.7175 3.4257 6.3523 2.2183 2.7407 1.4457 3.4189 3.5472 1.2444 1.2464 2.7144 5.4630 2.9097 1.5078 1.6958 2.5178 1.3875 1.3873 5.1849 5.3524 1.3534 1.3573 3.3978 2.2502 2.3197 2.1221 2.3414 1.6171 2.1753 2.0753 1.0537 1.0545 1.1475 1.2350 2.1267 2.8475 2.8068 4.2309 2.3804 2.6055 1.5607 1.3240 1.2959 1.8250 1.3275 2.6504 2.4748 5.8155 4.8348 3.3073 2.1282 2.1239 1.1401 1.1433 2.2201 2.1949 4.9836 9.0996 6.1089 6.0646 10.0483 5.9868 5.9846 10.5901 1.0591 1.0587 1.1056 1.1055 1.0846 1.0847 1.0880 1.0881 1.0927 1.0928 1.0968 1.0965 1.1016 1.1015 1.0994 1.0827
irintensity: 0.0622 0.0637 0.6908 0.2014 0.8225 0.6235 0.8085 2.5304 0.2710 9.8066 0.9920 0.3059 6.7410 6.5768 20.8275 6.0165 3.7120 9.0878 6.3716 0.0866 0.0449 7.2894 0.0046 0.2377 12.2240 39.5288 6.4837 17.1009 14.1770 27.3743 0.3021 0.0537 22.0602 47.1333 56.5740 11.0059 92.3089 56.3831 9.4023 21.0833 43.5131 10.4019 16.0622 6.8539 9.8416 0.3151 1.9899 0.2716 7.2889 26.9985 1.9095 7.5879 0.8078 0.5498 1.7681 0.0636 0.0408 1.7927 0.8401 3.1794 6.7513 7.6981 55.9560 4.9341 9.1362 28.8119 0.7629 0.0124 0.0525 11.2506 7.3681 23.9985 1.6177 23.5187 108.6426 28.3938 67.7259 9.2359 5.7867 2.0098 46.1159 20.5483 72.3871 23.2382 2.9788 2.1996 86.4597 9.6420 8.3277 51.5702 32.3829 20.0821 16.2245 98.5101 6.1698 17.9574 7.4746 406.9814 2.8669 3.2934 421.2689 18.6383 17.2467 0.4032 0.0913 0.0467 0.2498 3.3828 8.0257 12.6466 17.7320 23.3603 22.3584 13.8548 31.4087 2.2433 96.8327
temp: 298.150 k
press: 1.00000 atm
elementType: 8 8 7 7 7 7 6 6 6 6 6 6 6 6 6 6 6 6 6 6 6 6 6 6 6 1 1 1 1 1 1 1 1 1 1 1 1 1 1 1 1
symmnumber: 1
zpe: 833338.8 jmol-1
zpe.correction: 0.317402 hartree
zpe.thermalcorrener: 0.337391 hartree
zpe.thermalcorrenthalpy: 0.338335 hartree
zpe.thermalcorrgfe: 0.265786 hartree
zpe.sumelectzpe: -1101.384075 hartree
zpe.sumelectthermal: -1101.364086 hartree
zpe.sumelectthermalent: -1101.363141 hartree
zpe.sumelectthermalfe: -1101.435690 hartree
dipole: -1.9145 2.1217 -2.2671
dipole: 3.6478
quadrupole: -148.7115 -122.4009 -139.0639
quadrupole: -8.5981 2.7387 -4.1583
quadrupole: -11.9861 14.3245 -2.3384 -8.5981 2.7387 -4.1583
hfenergy: -1101.7014768 hartree
pointgroup: C01 [X(C19H16N4O2)]
dipole: 0.7401283 0.8398269 0.8981215 debye
polarizability: 236.3248108|8.7951261|258.0462961|4.2071082|14.580983|178.8652076 unknown
InChI: InChI=1S/C19H16N4O2/c24-18-16-17(21-13-20-16)22(11-14-7-3-1-4-8-14)19(25)23(18)12-15-9-5-2-6-10-15/h1-10,13,20H,11-12H2
charge 0 multiplicity 1
41 atoms
O  -0.205138 -0.598304 -2.199154
O  -2.252587 2.804863 0.365465
N  1.195367 0.831882 -0.989816
N  -1.209124 1.094075 -0.907626
N  0.643006 3.609995 1.149682
N  2.463126 2.480059 0.376505
C  1.294791 1.911635 -0.127342
C  0.155115 2.587322 0.330802
C  2.414412 0.098351 -1.447901
C  -0.077372 0.381191 -1.40838
C  -2.554997 0.591011 -1.338254
C  -1.191941 2.224554 -0.023923
C  2.820859 -1.031035 -0.50709
C  -3.116723 -0.477118 -0.40528
C  2.023549 3.50811 1.146804
C  2.308953 -2.339834 -0.697183
C  3.71829 -0.783384 0.562673
C  -3.912767 -0.107145 0.709201
C  -2.85913 -1.8506 -0.648538
C  2.687797 -3.386371 0.173004
C  4.097127 -1.83092 1.43193
C  -4.441545 -1.096293 1.568505
C  -3.388668 -2.838948 0.211211
C  3.583272 -3.134594 1.238809
C  -4.181694 -2.464744 1.321184
H  3.215272 0.852406 -1.524601
H  2.176456 -0.293904 -2.449635
H  -2.4266 0.193164 -2.357059
H  -3.21299 1.474954 -1.357864
H  0.062486 4.286416 1.645544
H  2.671713 4.179726 1.703541
H  1.608152 -2.525592 -1.519141
H  4.104535 0.231588 0.713202
H  -4.102705 0.955469 0.899579
H  -2.234475 -2.132075 -1.503654
H  2.288118 -4.395148 0.020065
H  4.792361 -1.632819 2.255637
H  -5.057037 -0.801762 2.426166
H  -3.185809 -3.898042 0.015421
H  3.878882 -3.947252 1.912205
H  -4.59444 -3.232184 1.98611
