program: Gaussian 09
title: 000250769
version: EM64L-G09RevD.01
frameworkgroup: C1[X(C20H13Cl)]
method: RPBEPBE
basis: SDD
operation: Freq
keyword: #p
keyword: freq=noraman
keyword: PBEPBE/SDD
title: #p freq=noraman PBEPBE/SDD
converged: YES YES NO NO
title: Mulliken charges:
elementType: Cl C C C C C C C C C C C C C C C C C C C C H H H H H H H H H H H H H
charge: -0.054632 0.382183 0.007649 0.111144 0.167585 0.132355 -0.425535 -0.370649 -0.366464 -0.404457 -0.415257 -0.254857 -0.267677 -0.238664 -0.238613 0.503512 -0.336411 -0.396594 -0.243080 -0.245939 -0.230679 0.249772 0.242104 0.272963 0.245873 0.248186 0.227886 0.228029 0.228256 0.228307 0.282465 0.256992 0.236806 0.237442
chargesum: 0.00000
title: Mulliken charges with hydrogens summed into heavy atoms:
elementType: Cl C C C C C C C C C C C C C C C C C C C C
charge: -0.054632 0.382183 0.007649 0.111144 0.167585 0.132355 -0.175763 -0.128545 -0.093501 -0.158584 -0.167071 -0.026971 -0.039648 -0.010408 -0.010306 0.503512 -0.336411 -0.114129 0.013912 -0.009133 0.006763
polarizability: 3.67752983e+02 -1.82849471e+01 2.77866497e+02 -4.21423407e+00 9.37152895e-02 1.11930296e+02
1716.lowfreq: -3.1815 -0.0018 -0.0014 -0.0013 3.3696 7.7009 29.4556 43.2793 59.2991
frequency: 29.4483 43.2754 59.2960 95.5710 127.4615 134.1695 160.6153 170.5635 206.9811 231.4301 272.2143 311.5312 371.2325 394.9404 401.1812 425.5300 428.3707 438.3862 471.6538 509.1177 524.4233 552.1292 567.3779 586.2156 616.8049 630.5224 650.4025 678.9157 711.5130 732.3594 739.3145 751.7530 760.2316 769.4957 782.4554 792.3985 835.1128 856.1441 872.8572 879.1895 888.6713 918.9119 949.3362 951.5668 962.1505 983.6830 985.5429 994.2195 995.0159 1016.2165 1024.9457 1034.7657 1040.1915 1075.9511 1111.8623 1121.5351 1143.8583 1169.4155 1172.1030 1177.4068 1201.5058 1229.1857 1244.3573 1283.8649 1295.1011 1304.2749 1340.0683 1370.6831 1384.7759 1402.6518 1424.6240 1438.1756 1443.4336 1456.8703 1467.1370 1481.0571 1561.6790 1582.9959 1590.1948 1597.9290 1613.2552 1613.5178 1643.2706 3094.8644 3122.3687 3125.3416 3129.8956 3137.1334 3137.9963 3143.2117 3151.7997 3155.5448 3162.3400 3164.6017 3171.4973 3177.3341
redmass: 7.4595 5.2603 5.3705 5.0528 6.0958 4.0592 4.6476 5.2377 5.8735 5.3845 4.1899 4.6099 6.2895 6.8250 4.0186 5.1456 3.4601 3.1214 3.6194 5.1330 3.5914 5.9731 3.3136 6.2378 6.9682 3.5478 6.4197 5.9355 4.8452 4.5141 1.8946 1.5093 1.7841 2.4084 1.9539 2.5191 4.6408 1.5134 1.4651 1.5053 1.5069 4.2427 1.4295 1.4423 1.3891 1.3440 1.3330 2.4577 2.0128 6.7332 2.3228 1.9606 2.0526 2.9685 1.7421 1.7478 1.7285 1.1264 1.0671 1.1281 1.8302 2.0233 1.9814 1.9202 1.4713 1.8627 2.1990 6.2981 3.0432 3.2248 2.3204 2.2854 2.8781 2.6098 2.7004 4.0490 5.8498 6.3479 6.6715 6.8544 7.1141 7.0814 8.6680 1.0868 1.0855 1.0857 1.0892 1.0864 1.0902 1.0943 1.0908 1.0955 1.1002 1.0960 1.0970 1.0997
irintensity: 0.2200 0.4392 0.6114 0.8379 2.0777 0.0920 0.0431 0.3364 1.2336 0.2792 0.6797 1.1522 1.7619 2.0383 4.4507 1.0766 3.3084 5.2030 3.6502 0.3458 0.8708 2.0810 0.1372 15.6547 3.2196 5.6222 4.7100 16.3137 2.1959 4.2245 96.3299 4.7546 37.4818 14.9595 98.6117 0.2102 0.8672 13.7290 2.9960 1.8638 0.0649 6.5993 1.2480 6.7136 1.5426 0.0132 0.4816 3.2403 0.6339 52.3572 3.1027 5.1006 6.2610 2.5925 3.7361 2.5581 1.1753 1.0255 0.0925 1.5080 0.5616 4.4135 2.2569 4.7018 5.8750 3.5477 4.1728 4.1520 6.3103 0.1545 25.3934 30.4721 31.9603 25.3838 2.1583 44.2127 7.4129 1.5924 0.5769 5.4909 4.8155 7.0275 6.5879 5.8012 3.5180 2.3559 2.2149 0.9943 8.0587 23.5650 15.5188 33.1179 44.7341 6.2615 15.0073 17.4727
temp: 298.150 k
press: 1.00000 atm
elementType: 17 6 6 6 6 6 6 6 6 6 6 6 6 6 6 6 6 6 6 6 6 1 1 1 1 1 1 1 1 1 1 1 1 1
symmnumber: 1
zpe: 682675.7 jmol-1
zpe.correction: 0.260017 hartree
zpe.thermalcorrener: 0.276048 hartree
zpe.thermalcorrenthalpy: 0.276992 hartree
zpe.thermalcorrgfe: 0.215465 hartree
zpe.sumelectzpe: -1228.599536 hartree
zpe.sumelectthermal: -1228.583506 hartree
zpe.sumelectthermalent: -1228.582562 hartree
zpe.sumelectthermalfe: -1228.644088 hartree
dipole: -0.4949 1.5100 1.1129
dipole: 1.9400
quadrupole: -107.0289 -115.9459 -134.5831
quadrupole: -6.0306 -3.1480 -1.2000
quadrupole: 12.1571 3.2401 -15.3971 -6.0306 -3.1480 -1.2000
hfenergy: -1228.8595538 hartree
pointgroup: C01 [X(C20H13Cl1)]
dipole: 0.3459559 0.3953612 -0.5536894 debye
polarizability: 371.0391234|-5.4080124|263.9687093|2.4371007|-40.3003893|122.5419425 unknown
InChI: InChI=1S/C20H13Cl/c21-20-12-6-1-7-14(20)13-19-17-10-4-2-8-15(17)16-9-3-5-11-18(16)19/h1-13H
charge 0 multiplicity 1
34 atoms
Cl 2.638493 -2.672259 2.158413
C  -0.347161 -0.392355 0.02309
C  -1.749524 -0.902949 0.038485
C  -0.463326 1.090912 -0.114346
C  -2.652734 0.193761 -0.12768
C  -1.856402 1.432573 -0.210096
C  0.742869 -1.221185 0.162559
C  -2.244599 -2.21761 0.153994
C  0.501534 2.12207 -0.078739
C  -4.044673 -0.018792 -0.176011
C  -2.27073 2.774626 -0.31578
C  -3.643811 -2.430288 0.112899
C  0.081344 3.47072 -0.175521
C  -4.536457 -1.340672 -0.05209
C  -1.291539 3.796265 -0.306135
C  2.17706 -0.936654 -0.010466
C  3.164522 -1.574498 0.791093
C  2.664557 -0.110871 -1.068903
C  4.546047 -1.39348 0.600636
C  4.04314 0.080858 -1.284814
C  4.989816 -0.554338 -0.446289
H  0.52651 -2.267445 0.419532
H  -1.568764 -3.071778 0.274162
H  1.564544 1.897253 0.038982
H  -4.740025 0.817835 -0.305668
H  -3.333615 3.029545 -0.390908
H  -4.041798 -3.446599 0.20772
H  0.828062 4.271869 -0.146039
H  -5.615855 -1.526086 -0.084615
H  -1.596044 4.845771 -0.386828
H  1.936081 0.348653 -1.744052
H  5.259598 -1.899201 1.257213
H  4.379616 0.713446 -2.112927
H  6.063259 -0.409995 -0.60677
