program: Gaussian 09
title: 000250765
version: EM64L-G09RevD.01
frameworkgroup: C1[X(C13H15N3O)]
method: RPBEPBE
basis: SDD
operation: Freq
keyword: #p
keyword: freq=noraman
keyword: PBEPBE/SDD
title: #p freq=noraman PBEPBE/SDD
converged: YES YES NO NO
title: Mulliken charges:
elementType: O N N N C C C C C C C C C C C C C H H H H H H H H H H H H H H H
charge: -0.252961 -0.493469 -0.144995 -0.062275 0.261276 0.066515 0.296416 0.230961 -0.055155 -0.801805 -0.374907 -0.428425 -0.670917 -0.638552 -0.232901 -0.226368 -0.235795 0.344049 0.264376 0.225769 0.235939 0.261058 0.250817 0.234420 0.252496 0.233410 0.222936 0.315869 0.221785 0.233902 0.231203 0.235329
chargesum: 0.00000
title: Mulliken charges with hydrogens summed into heavy atoms:
elementType: O N N N C C C C C C C C C C C C C
charge: -0.252961 -0.149420 -0.144995 -0.062275 0.261276 0.066515 0.296416 0.230961 -0.055155 -0.075721 -0.113849 -0.177608 0.049410 0.122038 0.001001 0.004835 -0.000466
polarizability: 2.23559398e+02 -1.00780149e+01 1.93451662e+02 6.10135192e+00 1.09627367e+01 9.75671249e+01
1716.lowfreq: -0.0004 -0.0002 0.0003 3.1871 6.2350 7.3660 44.7980 57.0874 75.6698
frequency: 44.7640 57.0840 75.6652 77.8467 89.0666 100.0043 145.9178 160.5612 164.5556 191.5183 225.1149 257.8684 266.0105 294.8705 326.1774 331.9993 354.4364 407.3848 432.0925 480.6696 488.2634 544.7797 550.9799 609.5631 631.3797 637.7026 651.0855 688.0214 708.3389 729.9584 752.9751 777.3405 808.9316 860.0162 913.7222 930.8519 980.9466 984.4734 991.1012 1000.5593 1013.8379 1034.2517 1039.9715 1062.5320 1082.3318 1095.5617 1108.2702 1137.2188 1159.7152 1175.2605 1191.3201 1213.8339 1242.5121 1277.3802 1309.0721 1320.3759 1375.0057 1389.9079 1400.6592 1414.5955 1431.7994 1440.0506 1446.8251 1450.8331 1469.4138 1476.4249 1480.7010 1484.7235 1496.8853 1502.1217 1554.6196 1581.7602 1605.6620 1611.8697 1637.9475 2933.8475 2966.9916 2982.1228 3001.2569 3045.3897 3060.7356 3103.8580 3106.0735 3111.8049 3120.8259 3132.7092 3144.6994 3157.2093 3169.7612 3547.0393
redmass: 3.5525 3.1206 3.6870 3.7832 3.0108 1.4737 1.1461 1.3052 2.6356 3.3037 2.8195 4.1867 4.6698 3.7896 3.9465 3.6034 3.7247 2.8556 4.8508 3.7299 3.6884 7.5426 1.1809 6.4303 5.2843 6.5089 5.1846 10.5169 1.8144 5.2563 6.4467 2.0248 5.5593 1.2414 3.5101 1.4035 1.5473 2.6588 3.2190 1.3414 3.9788 1.9651 1.4663 1.4879 1.6342 1.2341 2.5461 1.3287 3.1426 1.0540 1.1178 4.2224 3.0904 5.8815 1.8511 1.5177 6.0691 2.8328 1.2888 1.1706 2.4248 3.4090 1.0866 1.2352 1.0888 1.1817 1.1049 1.8569 1.0530 1.1706 6.0896 5.8243 4.4888 6.0855 7.2930 1.0401 1.0354 1.0390 1.1001 1.1026 1.0931 1.1005 1.0939 1.0979 1.0869 1.0869 1.0923 1.0957 1.1011 1.0771
irintensity: 1.4762 0.0510 3.0483 2.6289 0.2838 2.5458 0.5840 1.6235 0.8361 1.3050 0.6444 3.7121 4.7102 3.4271 3.3852 5.3210 1.9938 0.1378 5.3234 15.7990 2.6024 3.6232 74.5614 1.1411 6.8778 5.2631 1.8348 4.8005 45.3816 5.2829 17.4696 45.6073 3.8599 0.9940 27.3609 5.0771 19.1118 26.0272 14.6070 1.2223 19.4157 8.4522 2.0225 33.9151 8.8310 0.1960 7.3012 0.3607 26.1945 0.0287 0.1741 13.5158 54.9303 62.5165 38.8884 10.5093 3.8676 16.1252 50.0201 35.6522 36.2135 143.8625 27.7850 31.6044 0.7453 52.0565 29.6844 5.8613 8.9652 46.3713 605.0367 10.8835 444.6763 33.7552 87.0720 57.6069 111.3894 19.7376 38.7836 40.0233 14.2398 12.0366 14.5421 0.1471 7.2906 0.1471 18.1175 25.9359 16.4332 24.7193
temp: 298.150 k
press: 1.00000 atm
elementType: 8 7 7 7 6 6 6 6 6 6 6 6 6 6 6 6 6 1 1 1 1 1 1 1 1 1 1 1 1 1 1 1
symmnumber: 1
zpe: 676034.7 jmol-1
zpe.correction: 0.257488 hartree
zpe.thermalcorrener: 0.273874 hartree
zpe.thermalcorrenthalpy: 0.274818 hartree
zpe.thermalcorrgfe: 0.213222 hartree
zpe.sumelectzpe: -742.634915 hartree
zpe.sumelectthermal: -742.618529 hartree
zpe.sumelectthermalent: -742.617585 hartree
zpe.sumelectthermalfe: -742.679182 hartree
dipole: 3.6562 -8.3894 0.7042
dipole: 9.1786
quadrupole: -92.8509 -104.2462 -100.0834
quadrupole: 20.6487 0.3708 3.8450
quadrupole: 6.2093 -5.1861 -1.0232 20.6487 0.3708 3.8450
hfenergy: -742.8924035 hartree
pointgroup: C01 [X(C13H15N3O1)]
dipole: -1.5719663 -3.244759 0.2018702 debye
polarizability: 223.9817541|10.3607371|186.7538322|7.4535789|-25.3548431|103.842599 unknown
InChI: InChI=1S/C13H15N3O/c1-9-11(10-7-5-4-6-8-10)14-13(16(2)3)15-12(9)17/h4-8,14H,1-3H3
charge 0 multiplicity 1
32 atoms
O  2.199397 3.016727 -0.306946
N  0.674796 -0.740546 0.027833
N  2.879225 -1.612461 0.160454
N  2.567429 0.720458 -0.053235
C  -0.246118 0.329926 -0.076418
C  0.238466 1.621995 -0.16262
C  -1.675696 -0.0904 -0.064029
C  2.052515 -0.503272 0.042984
C  1.721245 1.844834 -0.18452
C  -0.619454 2.863295 -0.204838
C  -2.59753 0.419301 -1.01741
C  -2.135457 -1.045415 0.885776
C  2.338432 -2.96818 0.312448
C  4.341164 -1.431391 0.130545
C  -3.942526 -0.007365 -1.015888
C  -3.481711 -1.470996 0.886445
C  -4.390775 -0.954372 -0.065587
H  0.302998 -1.69019 -0.009373
H  -0.147645 3.642901 0.418094
H  -1.648938 2.679647 0.143163
H  -0.659646 3.283724 -1.228097
H  -2.250696 1.133931 -1.770598
H  -1.449284 -1.421526 1.654597
H  1.668221 -3.054629 1.192376
H  3.176031 -3.664375 0.471437
H  1.79174 -3.314574 -0.590577
H  4.798121 -1.773477 1.078738
H  4.540739 -0.357052 -0.000407
H  4.788537 -1.995788 -0.709816
H  -4.638364 0.393082 -1.761195
H  -3.822912 -2.194768 1.634862
H  -5.435403 -1.284045 -0.0657
