program: Gaussian 09
title: 000250760
version: EM64L-G09RevD.01
frameworkgroup: C1[X(C12H19N5O2)]
method: RPBEPBE
basis: SDD
operation: Freq
keyword: #p
keyword: freq=noraman
keyword: PBEPBE/SDD
title: #p freq=noraman PBEPBE/SDD
converged: YES YES NO NO
title: Mulliken charges:
elementType: O O N N N N N C C C C C C C C C C C C H H H H H H H H H H H H H H H H H H H
charge: -0.272790 -0.259733 -0.146030 -0.159439 -0.090831 -0.096305 -0.412180 0.138301 -0.381353 0.084457 -0.357787 -0.320455 -0.212587 0.143068 -0.358685 0.172455 -0.686343 -0.618932 -0.625864 0.227293 0.262229 0.215934 0.230133 0.241117 0.231807 0.269609 0.222917 0.225778 0.360364 0.216906 0.214090 0.222289 0.223931 0.193806 0.227391 0.254955 0.223522 0.196961
chargesum: 0.00000
title: Mulliken charges with hydrogens summed into heavy atoms:
elementType: O O N N N N N C C C C C C C C C C C C
charge: -0.272790 -0.259733 -0.146030 -0.159439 -0.090831 -0.096305 -0.051816 0.138301 0.108169 0.084457 0.088280 0.152469 0.057023 0.143068 0.090011 0.172455 -0.033058 0.026196 0.049575
polarizability: 2.36682183e+02 1.88605937e+00 1.75013306e+02 -5.22977016e+00 1.13790227e+01 1.11785828e+02
1716.lowfreq: -11.3106 -0.0006 -0.0004 0.0004 4.6618 5.9636 25.1088 30.7702 35.9668
frequency: 24.7126 30.7083 35.9066 42.2083 62.4446 81.6511 91.6743 115.3976 151.0396 178.9185 182.8992 204.6557 221.5436 224.1965 234.8297 251.5274 271.6175 298.6767 315.1694 342.3949 363.1154 380.9539 405.8935 421.2192 441.2878 486.6278 534.3620 590.8856 612.0825 644.1903 678.1475 694.6279 706.3405 730.5906 751.0790 760.4760 766.4739 784.0212 808.1574 832.0812 859.2373 890.3558 943.5325 1019.3318 1026.1100 1036.5885 1046.7170 1052.0810 1053.8892 1088.1105 1098.2896 1114.6237 1132.8971 1146.6943 1158.5033 1172.8983 1198.2692 1239.4924 1242.7023 1270.5798 1276.4226 1289.0632 1300.8256 1306.3587 1315.7306 1317.3770 1346.8763 1354.4796 1366.3989 1366.8219 1378.6247 1391.4329 1417.7480 1426.4784 1444.2815 1449.6337 1459.3174 1463.6470 1471.9477 1474.9135 1475.1000 1478.7901 1480.8787 1486.2258 1490.5327 1503.6982 1561.2081 1642.3330 1654.9383 2862.6382 2879.8597 2906.4653 2977.6293 2995.6270 3019.4319 3028.4445 3029.3501 3032.7268 3041.6039 3044.8307 3074.7619 3077.2595 3081.1075 3094.7472 3100.9895 3112.2636 3239.1821 3529.7203
redmass: 3.3039 3.2522 3.6101 3.9068 6.9744 1.7249 2.6016 5.2431 4.8931 2.5964 3.9264 1.5604 1.3645 1.4093 4.1522 1.4234 3.0392 2.7807 3.4682 4.5145 4.2036 5.2148 4.3302 2.7389 3.2726 5.7824 6.7749 8.7172 3.8143 2.9472 4.2375 4.9205 4.1518 3.2805 1.2287 3.0652 2.8718 1.6283 1.4880 3.5838 1.4435 1.8213 3.1070 3.0945 2.7949 2.2396 1.5232 2.9703 2.6134 1.3543 3.2274 2.2299 1.6052 1.8758 2.7061 2.5536 1.9155 2.3311 2.6114 1.7083 2.3142 4.6065 1.4021 1.3408 1.4545 1.3377 2.3265 1.6910 1.4538 1.3687 2.9935 1.2108 2.3029 1.1637 1.1814 1.1063 1.1588 1.1955 1.0581 1.0639 1.0780 1.0441 1.0661 1.0758 1.0579 4.7523 8.8845 9.2375 6.2083 1.0560 1.0559 1.0677 1.0358 1.0597 1.0738 1.0592 1.0781 1.0894 1.0599 1.1013 1.1017 1.1009 1.0990 1.1007 1.1064 1.1062 1.0988 1.0769
irintensity: 0.6284 0.1515 0.4252 1.0502 0.0299 0.0759 0.2235 0.3574 2.7310 2.7415 1.8162 6.3625 0.7336 0.8935 4.8702 1.6560 2.1312 6.6655 12.3938 21.1802 2.4568 3.2081 2.8979 1.6296 2.1369 14.3681 16.3970 2.7271 3.8381 27.1205 14.5084 2.0581 3.5315 34.3485 4.5386 74.2336 20.5797 5.7159 17.2582 15.0744 0.6600 12.1270 4.8747 3.0233 4.7705 10.4608 11.4069 1.5716 73.3840 15.0603 17.2789 5.7542 24.6815 12.3355 10.0483 15.3774 76.7014 15.6744 38.7000 13.4825 24.5446 10.9811 7.8439 3.7375 13.6605 11.3886 42.6618 40.9295 3.4776 5.6010 11.0295 15.3626 121.2240 7.3686 3.2996 11.3119 55.4235 48.6480 19.9646 10.2137 30.1506 13.1074 15.7336 17.3870 13.4057 44.6586 67.8583 480.5709 724.8364 111.5871 117.0996 81.0328 38.1728 13.7292 43.6346 28.7019 48.9576 12.8012 28.5589 0.3251 39.1087 32.4483 39.5917 27.9596 14.3276 7.6204 1.6726 67.7810
temp: 298.150 k
press: 1.00000 atm
elementType: 8 8 7 7 7 7 7 6 6 6 6 6 6 6 6 6 6 6 6 1 1 1 1 1 1 1 1 1 1 1 1 1 1 1 1 1 1 1
symmnumber: 1
zpe: 819839.2 jmol-1
zpe.correction: 0.312260 hartree
zpe.thermalcorrener: 0.331835 hartree
zpe.thermalcorrenthalpy: 0.332780 hartree
zpe.thermalcorrgfe: 0.262258 hartree
zpe.sumelectzpe: -891.459851 hartree
zpe.sumelectthermal: -891.440275 hartree
zpe.sumelectthermalent: -891.439331 hartree
zpe.sumelectthermalfe: -891.509853 hartree
dipole: 2.4414 -3.4493 0.3298
dipole: 4.2387
quadrupole: -112.7769 -118.7755 -112.6547
quadrupole: 0.9905 3.0865 -0.5714
quadrupole: 1.9588 -4.0398 2.0810 0.9905 3.0865 -0.5714
hfenergy: -891.7721108 hartree
pointgroup: C01 [X(C12H19N5O2)]
dipole: -0.9951882 1.3216688 0.209278 debye
polarizability: 236.616521|3.181767|176.1884107|4.7448838|-7.7682889|110.6763848 unknown
InChI: InChI=1S/C12H19N5O2/c1-4-5-17-10-9(11(18)14-12(17)19)16(8-13-10)7-6-15(2)3/h8,14H,4-7H2,1-3H3
charge 0 multiplicity 1
38 atoms
O  -1.376636 -2.220844 -0.338093
O  3.287388 -2.270478 0.176803
N  -1.06202 0.888568 -0.831948
N  2.305573 -0.184813 -0.298258
N  -4.598163 0.302558 0.39699
N  1.007203 1.869781 -0.783235
N  0.964914 -2.155387 -0.096686
C  -0.134788 -0.125935 -0.543973
C  -2.53109 0.728646 -0.891962
C  1.122701 0.510072 -0.528187
C  -3.178087 0.686557 0.518108
C  3.611268 0.521062 -0.259099
C  -0.330073 2.055839 -0.957986
C  -0.301914 -1.543762 -0.333341
C  3.92097 1.114198 1.1330
C  2.260669 -1.574432 -0.055112
C  5.283851 1.837751 1.13661
C  -5.490858 0.963438 1.368377
C  -4.800163 -1.163601 0.354541
H  -2.953314 1.565859 -1.472493
H  -2.751989 -0.211161 -1.42223
H  -3.108445 1.689116 0.979579
H  -2.598956 -0.017438 1.161077
H  4.383431 -0.214923 -0.540143
H  3.574276 1.323735 -1.016125
H  -0.79178 3.014655 -1.18205
H  3.924119 0.298189 1.880028
H  3.116953 1.821168 1.411482
H  0.953542 -3.16666 0.069174
H  6.105792 1.143731 0.879573
H  5.297692 2.668124 0.405877
H  5.501932 2.262595 2.132568
H  -5.373762 2.060042 1.305697
H  -5.309087 0.651916 2.427752
H  -6.540875 0.721129 1.123155
H  -4.08289 -1.632146 -0.339611
H  -5.824421 -1.388307 0.006629
H  -4.654462 -1.644946 1.352915
