program: Gaussian 09
title: 000250740
version: EM64L-G09RevD.01
frameworkgroup: C1[X(C10H14N4O2S)]
method: RPBEPBE
basis: SDD
operation: Freq
keyword: #p
keyword: freq=noraman
keyword: PBEPBE/SDD
title: #p freq=noraman PBEPBE/SDD
converged: NO YES NO NO
title: Mulliken charges:
elementType: S O O N N N N C C C C C C C C C C H H H H H H H H H H H H H H
charge: 0.338897 -0.266137 -0.237206 -0.224670 -0.222010 -0.641399 0.017437 -0.387386 0.242554 0.517277 -0.364724 -0.306688 -0.562164 0.299338 -0.673913 -0.675465 -0.335781 0.277609 0.208683 0.245439 0.207514 0.240870 0.250736 0.226284 0.232641 0.202420 0.246968 0.234354 0.221562 0.340662 0.346297
chargesum: 0.00000
title: Mulliken charges with hydrogens summed into heavy atoms:
elementType: S O O N N N N C C C C C C C C C C
charge: 0.338897 -0.266137 -0.237206 -0.224670 -0.222010 0.045560 0.017437 0.098906 0.242554 0.517277 0.088228 0.184918 -0.562164 0.299338 -0.012568 0.027419 -0.335781
polarizability: 1.89596158e+02 1.99322077e+00 1.71567105e+02 -9.64599619e+00 -3.20789403e+00 1.18118036e+02
1716.lowfreq: -5.1304 -0.0007 0.0011 0.0020 2.6022 7.5128 24.4913 36.6567 50.0814
frequency: 24.4374 36.6222 50.0531 53.9556 57.4405 75.6538 97.4794 108.0103 163.0867 171.0312 205.2185 213.5295 227.0667 265.2490 274.5504 304.1022 320.5803 345.8051 363.9083 370.4713 385.8799 405.3517 410.9651 432.1471 466.3212 498.3283 562.3770 582.9319 591.7647 641.2769 674.6094 677.2010 708.8022 744.1916 748.3418 765.4270 796.6430 856.3402 879.1415 911.2379 984.9142 1028.1969 1049.9855 1067.8065 1086.6765 1095.5853 1109.8391 1179.9507 1186.7691 1202.3238 1217.7389 1264.6109 1293.2638 1313.4947 1327.3455 1341.2403 1363.4952 1371.2405 1387.0473 1397.1626 1445.0027 1463.4576 1471.3106 1475.3061 1480.6012 1481.5617 1490.8770 1497.8569 1554.1795 1606.8116 1628.4150 1639.4522 2104.4030 2980.2291 2989.7745 2993.9520 2999.8883 3045.4107 3045.8778 3074.5847 3088.2386 3091.0152 3091.4616 3095.4412 3121.4365 3524.2966 3687.7724
redmass: 7.9221 3.0242 5.1758 4.0392 5.6997 2.8283 2.2373 9.2839 5.5594 4.2926 1.7388 1.1897 1.9609 5.5554 3.1468 5.7485 2.0434 2.7857 6.1358 8.0927 2.6118 4.7252 2.5950 4.7421 10.7425 3.8888 2.9963 1.7012 6.0088 8.2933 8.6793 2.9011 10.8009 8.1659 1.2464 1.7917 2.0774 1.8927 1.4865 2.2745 2.4304 2.4986 3.0020 2.9983 1.7181 2.0148 2.1965 2.7082 4.2147 3.6127 3.6097 1.3625 1.3204 1.7859 1.4760 1.4633 1.3909 1.5463 1.2322 1.2061 1.1120 1.3957 1.0435 1.0405 1.0488 1.0500 1.2864 1.8001 4.1604 2.6622 4.0358 3.2263 12.7338 1.0369 1.0631 1.0353 1.0679 1.0960 1.0602 1.0986 1.0992 1.0993 1.0993 1.1008 1.1060 1.0494 1.1001
irintensity: 1.9393 0.9191 1.0544 1.2858 0.1379 4.8925 3.0602 1.6883 1.4303 0.2110 0.2606 0.0496 2.1953 11.1524 2.6861 2.8400 31.4312 7.0821 15.6092 5.9511 43.4515 7.6619 14.5891 11.4035 27.1666 9.9889 33.3279 63.6612 23.6557 3.5811 5.1478 2.3475 1.9712 43.8855 5.6558 4.2626 15.4954 3.1414 8.7614 8.4417 7.8067 23.2515 1.4808 1.3190 5.5108 12.1991 5.9384 22.3074 7.3775 34.9633 35.8961 13.2315 19.7966 76.3118 28.1008 26.7352 4.3747 50.3322 14.9011 13.8721 48.1351 57.5871 27.6295 5.7058 20.0065 9.6157 41.1803 165.7314 23.2197 398.4620 588.0606 377.8502 12.3400 32.9442 13.8252 21.1126 39.5068 2.7129 13.2655 39.0748 27.5177 30.0830 15.5253 16.1441 6.7326 74.5046 66.7358
temp: 298.150 k
press: 1.00000 atm
elementType: 16 8 8 7 7 7 7 6 6 6 6 6 6 6 6 6 6 1 1 1 1 1 1 1 1 1 1 1 1 1 1
symmnumber: 1
zpe: 627470.2 jmol-1
zpe.correction: 0.238991 hartree
zpe.thermalcorrener: 0.257560 hartree
zpe.thermalcorrenthalpy: 0.258504 hartree
zpe.thermalcorrgfe: 0.190545 hartree
zpe.sumelectzpe: -1155.708265 hartree
zpe.sumelectthermal: -1155.689696 hartree
zpe.sumelectthermalent: -1155.688752 hartree
zpe.sumelectthermalfe: -1155.756711 hartree
dipole: 6.1975 -3.4846 -2.5472
dipole: 7.5524
quadrupole: -122.2252 -99.6417 -113.9942
quadrupole: -11.2493 7.1983 9.4212
quadrupole: -10.2715 12.3120 -2.0405 -11.2493 7.1983 9.4212
hfenergy: -1155.9472559 hartree
pointgroup: C01 [X(C10H14N4O2S1)]
dipole: 2.5805968 1.1243268 0.9515156 debye
polarizability: 189.8125216|-3.888419|172.2494949|6.1854704|-1.1534455|117.219283 unknown
InChI: InChI=1S/C10H14N4O2S/c1-3-5-14-8(12)7(17-6-11)9(15)13(4-2)10(14)16/h3-5,12H2,1-2H3
charge 0 multiplicity 1
31 atoms
S  -2.54227 1.743624 0.929669
O  1.960172 -2.048785 0.109202
O  -2.660231 -1.314682 0.414933
N  1.208942 0.134199 0.501907
N  -0.346707 -1.688435 0.293016
N  0.46672 2.369168 0.818463
N  -3.135734 2.650046 -1.830256
C  2.632835 0.570034 0.503714
C  0.983433 -1.266529 0.286558
C  0.15917 1.040203 0.6591
C  3.11153 1.105488 -0.866152
C  -0.607544 -3.137343 0.049463
C  -1.16444 0.571156 0.658399
C  -1.495095 -0.826313 0.457762
C  4.586707 1.554619 -0.803335
C  -0.742391 -3.452101 -1.452188
C  -2.876886 2.261277 -0.726664
H  3.222819 -0.323578 0.764519
H  2.781393 1.312077 1.31216
H  2.996292 0.296871 -1.61079
H  2.473423 1.944204 -1.207682
H  0.230198 -3.698619 0.493323
H  -1.543749 -3.376346 0.578575
H  5.244031 0.718358 -0.502696
H  4.92974 1.912065 -1.789828
H  4.733664 2.378027 -0.078524
H  -1.577394 -2.884227 -1.896386
H  0.189991 -3.211723 -1.991606
H  -0.949165 -4.528915 -1.58849
H  -0.305062 3.022796 0.952167
H  1.41311 2.726686 0.738069
