program: Gaussian 09
title: 000250737
version: EM64L-G09RevD.01
frameworkgroup: C1[X(C10H10N6O)]
method: RPBEPBE
basis: SDD
operation: Freq
keyword: #p
keyword: freq=noraman
keyword: PBEPBE/SDD
title: #p freq=noraman PBEPBE/SDD
converged: YES YES NO NO
title: Mulliken charges:
elementType: O N N N N N N C C C C C C C C C C H H H H H H H H H H
charge: -0.280546 -0.409993 -0.145069 -0.108569 -0.637821 -0.079857 -0.579660 0.453155 0.321741 -0.344286 -0.450971 -0.339347 -0.358493 0.098756 0.144030 0.093377 -0.310584 0.305675 0.229888 0.202885 0.279266 0.338562 0.250462 0.315423 0.335634 0.332889 0.343453
chargesum: 0.00000
title: Mulliken charges with hydrogens summed into heavy atoms:
elementType: O N N N N N N C C C C C C C C C C
charge: -0.280546 -0.071431 -0.145069 -0.108569 0.013236 -0.079857 0.096683 0.453155 0.321741 -0.038611 -0.221084 -0.136462 -0.079227 0.098756 0.144030 0.093377 -0.060122
polarizability: 2.92467059e+02 -2.43657315e+00 1.69928482e+02 -5.92647770e-01 3.72742027e-01 6.21177704e+01
1716.lowfreq: -4.3446 -1.6676 -0.0007 -0.0004 -0.0002 7.3133 31.0599 43.1283 55.5913
frequency: 30.9708 43.1254 55.5057 78.6708 110.5535 176.3889 185.3197 205.2018 247.7971 285.7343 306.1434 398.4078 407.4046 428.0094 446.8221 461.6811 480.1591 509.2453 515.4098 561.1477 567.2514 579.6351 582.1995 623.2201 669.0280 683.7281 696.4842 720.0814 732.1378 764.3379 786.8892 803.3514 843.8161 860.1821 864.7773 915.1165 946.5775 964.5795 983.6382 992.3288 1007.1510 1042.6984 1074.9522 1118.3748 1134.9866 1187.4864 1191.1151 1248.2413 1268.2891 1308.9906 1324.9148 1352.2285 1372.7412 1404.6815 1423.5340 1467.5778 1494.2189 1504.6976 1521.4058 1543.8031 1575.5974 1594.9905 1621.0055 1625.2973 1632.6774 3119.4189 3122.9164 3163.9179 3164.0599 3193.0590 3514.0220 3530.1155 3551.7640 3683.5774 3710.4145
redmass: 5.2272 6.3366 3.9216 5.8968 7.2086 6.3091 7.8943 6.7333 8.2068 4.3864 4.6808 3.5860 2.6359 3.9143 2.7598 1.6033 2.8025 2.2280 1.2800 1.0473 8.3023 1.2605 4.8564 6.7468 6.7326 2.0767 3.5776 4.8450 2.3444 3.9010 6.4198 8.2922 1.2963 2.1788 3.6979 10.6913 2.6884 1.4487 1.3434 1.3605 3.0562 1.9550 2.7481 2.0626 1.6893 3.7248 1.2437 3.5457 2.5396 1.6426 1.9822 4.2165 2.4055 2.5102 4.2139 4.6856 2.2923 2.9618 5.3309 3.1502 2.5016 2.5751 2.1030 3.8169 2.3972 1.0902 1.0900 1.0946 1.0934 1.0941 1.0751 1.0447 1.0445 1.1039 1.1058
irintensity: 8.7181 0.2665 6.0388 0.8846 0.3661 12.6923 3.8072 2.8727 2.4034 0.3071 0.6725 12.9987 4.8576 2.6553 31.0772 43.2488 41.8374 69.4510 301.4651 22.6298 6.6762 58.0681 4.6655 1.7721 9.6894 27.5457 65.8891 9.2016 8.7212 31.7351 3.2748 43.1876 0.5169 68.9195 22.7434 25.3030 0.2301 9.3886 1.5193 2.3647 2.7379 5.0311 1.1812 5.2151 14.2461 5.4282 42.5378 54.0903 6.9987 13.0147 16.8672 552.5429 11.7439 165.9997 37.9042 53.1874 294.4574 192.7824 1405.4221 223.5396 22.3391 158.8006 333.2516 102.6779 270.0953 22.2262 12.6071 1.2259 27.0291 9.7351 45.7019 42.3564 112.6003 29.7387 51.8530
temp: 298.150 k
press: 1.00000 atm
elementType: 8 7 7 7 7 7 7 6 6 6 6 6 6 6 6 6 6 1 1 1 1 1 1 1 1 1 1
symmnumber: 1
zpe: 534180.3 jmol-1
zpe.correction: 0.203459 hartree
zpe.thermalcorrener: 0.217856 hartree
zpe.thermalcorrenthalpy: 0.218800 hartree
zpe.thermalcorrgfe: 0.160738 hartree
zpe.sumelectzpe: -789.644251 hartree
zpe.sumelectthermal: -789.629854 hartree
zpe.sumelectthermalent: -789.628909 hartree
zpe.sumelectthermalfe: -789.686971 hartree
dipole: -2.3439 4.5614 0.7696
dipole: 5.1858
quadrupole: -117.3094 -74.9790 -103.3329
quadrupole: 6.9113 4.6527 0.3668
quadrupole: -18.7690 23.5614 -4.7925 6.9113 4.6527 0.3668
hfenergy: -789.8477096 hartree
pointgroup: C01 [X(C10H10N6O1)]
dipole: 0.9057831 1.7826233 -0.4055496 debye
polarizability: 292.3805656|3.9181374|169.5250814|1.8633184|-7.1283089|62.6076646 unknown
InChI: InChI=1S/C10H10N6O/c11-8(17)6-1-3-7(4-2-6)15-10-14-5-13-9(12)16-10/h1-5,15H,11-12H2
charge 0 multiplicity 1
27 atoms
O  -5.456867 -0.463772 0.187516
N  0.962355 -1.270549 0.064778
N  2.284581 0.729684 0.002266
N  3.261435 -1.509617 0.093011
N  -4.888346 1.709451 -0.365848
N  4.719718 0.435736 0.031171
N  3.743789 2.563421 -0.054135
C  -0.361124 -0.774795 0.035594
C  -3.091288 0.048312 -0.026571
C  -0.687237 0.607783 -0.005512
C  -1.411302 -1.738008 0.057182
C  -2.039377 1.000401 -0.035895
C  -2.751866 -1.328884 0.030348
C  2.186986 -0.631081 0.0521
C  -4.554046 0.397923 -0.054616
C  3.574928 1.207981 -0.00679
C  4.47691 -0.904749 0.080219
H  0.12131 1.339587 -0.007107
H  -1.168308 -2.807389 0.096487
H  -2.25471 2.075961 -0.037546
H  -3.568595 -2.057267 0.056032
H  1.073053 -2.288628 0.102843
H  5.353133 -1.559306 0.110989
H  -4.206077 2.406301 -0.654367
H  -5.878249 1.951947 -0.37628
H  2.930671 3.173436 -0.080551
H  4.689726 2.937723 -0.058916
