program: Gaussian 09
title: 000253611
version: EM64L-G09RevD.01
frameworkgroup: C1[X(C11H11N3O7)]
method: RPBEPBE
basis: SDD
operation: Freq
keyword: #p
keyword: freq=noraman
keyword: PBEPBE/SDD
title: #p freq=noraman PBEPBE/SDD
converged: YES YES NO NO
title: Mulliken charges:
elementType: O O O O O O O N N N C C C C C C C C C C C H H H H H H H H H H H
charge: -0.156810 -0.153589 -0.154534 -0.170806 -0.213943 -0.194869 -0.186640 0.074346 0.098098 0.022930 0.144892 -0.437413 0.481040 -0.525107 -0.429588 -0.397567 0.234642 0.361332 -0.203810 -0.363872 -0.771103 0.266176 0.260595 0.258056 0.271585 0.320358 0.271604 0.249019 0.296872 0.248938 0.238287 0.260883
chargesum: 0.00000
title: Mulliken charges with hydrogens summed into heavy atoms:
elementType: O O O O O O O N N N C C C C C C C C C C C
charge: -0.156810 -0.153589 -0.154534 -0.170806 -0.213943 -0.194869 -0.186640 0.074346 0.098098 0.022930 0.144892 0.089358 0.481040 0.004534 -0.109230 -0.125963 0.234642 0.361332 0.045209 -0.067000 -0.022995
polarizability: 2.28060894e+02 -6.85288655e+00 1.73288499e+02 1.32830424e+01 1.84329042e+00 1.05375292e+02
1716.lowfreq: -2.9591 -0.0006 -0.0004 0.0004 3.7531 7.5077 19.4491 24.8193 44.7716
frequency: 19.0003 24.5079 44.7413 48.5508 56.2669 59.4910 72.1996 81.9707 94.8702 115.4048 136.8612 174.9225 178.7728 183.7164 224.3475 242.4131 252.8594 289.5465 315.6975 333.7847 376.4491 391.4662 424.6808 427.8770 463.7757 475.3404 506.3731 524.4660 552.0660 596.0127 635.5373 648.0954 685.6955 690.3561 694.1014 715.4074 736.3253 755.3370 778.8117 799.6884 824.9065 833.3054 925.6816 942.5025 951.8046 955.5358 960.1281 990.3686 1006.8555 1054.7003 1069.9153 1094.9440 1098.7444 1116.3703 1178.4625 1180.2694 1186.6308 1194.5650 1208.2460 1214.3525 1241.6145 1291.8259 1302.1599 1308.2059 1355.6968 1375.0085 1380.1499 1388.0511 1413.1300 1419.0305 1434.9471 1439.4964 1442.8325 1447.0526 1455.6064 1481.6932 1589.1180 1616.8618 1632.6215 2982.6949 2995.3103 3023.9760 3049.6190 3069.6582 3089.3819 3124.4765 3158.6614 3177.2286 3182.1594 3190.4169
redmass: 6.5136 4.8350 5.4816 9.4243 5.6409 5.6838 1.2866 7.1601 9.4583 6.6047 3.1645 6.0625 8.6557 7.6643 4.4851 3.5904 8.5961 3.6201 10.3692 8.2332 10.2405 5.7233 3.3111 3.9325 2.0664 7.6271 6.3691 6.8478 6.1378 4.5345 3.9707 6.4051 3.9752 8.2779 2.9665 4.3668 4.4334 12.3236 2.1114 7.9980 1.5549 4.1261 1.4737 3.5409 1.6493 1.5598 1.8779 6.1169 1.3608 4.3188 2.2271 1.5978 2.0507 4.2268 6.7615 2.3820 1.3015 1.3044 4.3887 6.8080 4.0900 1.6396 1.2698 1.1843 1.6017 1.2344 10.1444 6.9556 9.8116 1.5094 1.4495 2.3376 1.1098 2.2560 1.0611 2.4277 6.3417 6.9283 7.5450 1.0396 1.0612 1.0606 1.0961 1.0946 1.1015 1.1005 1.0882 1.0931 1.0926 1.0981
irintensity: 0.2100 8.5286 0.6956 0.7251 0.7382 0.5610 0.7049 0.7896 0.3046 3.6977 2.0873 3.2378 3.0387 3.8541 5.8576 1.0116 3.7544 0.6109 2.5606 0.4568 2.8666 0.9253 1.2055 7.7325 2.4523 6.1408 5.3286 5.8459 5.7551 1.6937 2.1951 1.8669 12.7362 19.7480 36.1082 3.7876 63.6647 24.2199 4.4893 7.4425 29.4568 0.4672 5.7317 8.9476 1.5427 6.5370 1.4640 0.6150 0.6763 2.5168 1.4736 19.2050 30.0088 1.8773 102.0279 52.3121 44.8647 2.7461 91.0871 159.7234 65.3332 166.4174 1.6792 5.7197 20.6600 73.4724 108.1817 5.0614 153.3841 20.0582 77.5664 9.0123 14.3346 59.5655 21.8638 18.0094 4.3996 3.2007 91.3076 1.1011 10.1706 15.0366 2.7088 10.0264 1.5522 10.5772 4.4805 1.1218 8.0056 5.4866
temp: 298.150 k
press: 1.00000 atm
elementType: 8 8 8 8 8 8 8 7 7 7 6 6 6 6 6 6 6 6 6 6 6 1 1 1 1 1 1 1 1 1 1 1
symmnumber: 1
zpe: 579439.7 jmol-1
zpe.correction: 0.220697 hartree
zpe.thermalcorrener: 0.241212 hartree
zpe.thermalcorrenthalpy: 0.242157 hartree
zpe.thermalcorrgfe: 0.168176 hartree
zpe.sumelectzpe: -1114.776237 hartree
zpe.sumelectthermal: -1114.755722 hartree
zpe.sumelectthermalent: -1114.754777 hartree
zpe.sumelectthermalfe: -1114.828758 hartree
dipole: 4.3409 3.8322 0.0227
dipole: 5.7905
quadrupole: -130.0098 -126.8673 -129.2608
quadrupole: -18.6770 -4.0742 2.0065
quadrupole: -1.2972 1.8453 -0.5482 -18.6770 -4.0742 2.0065
hfenergy: -1114.9969339 hartree
pointgroup: C01 [X(C11H11N3O7)]
dipole: -1.708618 -1.5065662 0.0298991 debye
polarizability: 227.0823772|-6.5995524|173.3442328|-17.2795994|-0.1382365|106.2980746 unknown
InChI: InChI=1S/C11H11N3O7/c1-8(15)5-6-11(13(18)19,14(20)21)9-3-2-4-10(7-9)12(16)17/h2-4,7H,5-6H2,1H3
charge 0 multiplicity 1
32 atoms
O  -0.189776 1.185906 -2.111577
O  0.176168 2.016448 1.640341
O  -1.434071 2.484242 -0.710124
O  -1.54379 0.719003 2.380015
O  -4.287537 -2.024184 -0.19381
O  5.423591 -0.411097 -0.33316
O  4.268766 1.554726 -0.409815
N  -0.745829 1.441507 -0.988754
N  -0.69727 1.095336 1.498183
N  4.329658 0.271774 -0.308884
C  -0.686565 0.303141 0.109004
C  -1.959057 -0.546223 -0.039685
C  0.629654 -0.45899 0.030135
C  -3.299303 0.207196 -0.116705
C  1.849119 0.247934 -0.110895
C  0.653532 -1.873071 0.130527
C  -4.47544 -0.778968 -0.143576
C  3.050705 -0.478298 -0.153265
C  1.877965 -2.576842 0.089118
C  3.095412 -1.885204 -0.054844
C  -5.867807 -0.171918 -0.087601
H  -1.841104 -1.173792 -0.940927
H  -2.002777 -1.232815 0.823222
H  -3.372264 0.84009 -1.022983
H  -3.433813 0.891889 0.741492
H  1.887849 1.337845 -0.184762
H  -0.27438 -2.440485 0.239276
H  1.877162 -3.667958 0.1678
H  4.059054 -2.399504 -0.092704
H  -6.09036 0.136063 0.953107
H  -5.944163 0.733881 -0.715352
H  -6.620628 -0.912632 -0.398198
