program: Gaussian 09
title: 000253629
version: EM64L-G09RevD.01
frameworkgroup: C1[X(C19H16N2)]
method: RPBEPBE
basis: SDD
operation: Freq
keyword: #pfreq=noraman
keyword: PBEPBE/SDD
title: #p freq=noraman PBEPBE/SDD
converged: YES YES NO NO
title: Mulliken charges:
elementType: N N C C C C C C C C C C C C C C C C C C C H H H H H H H H H H H H H H H H
charge: -0.444941 -0.070013 0.199045 0.134610 0.161078 0.247342 0.192672 -0.381215 0.171875 -0.014786 -0.021603 -0.408879 -0.364405 -0.779059 -0.398279 -0.259877 -0.794109 -0.217961 -0.337741 -0.256384 -0.226916 0.205870 0.308559 0.272013 0.231765 0.254588 0.252676 0.230236 0.225618 0.228981 0.252244 0.261071 0.226987 0.249515 0.225861 0.220437 0.223125
chargesum: 0.00000
title: Mulliken charges with hydrogens summed into heavy atoms:
elementType: N N C C C C C C C C C C C C C C C C C C C
charge: -0.136381 -0.070013 0.199045 0.134610 0.161078 0.247342 0.192672 -0.175345 0.171875 -0.014786 -0.021603 -0.136867 -0.132640 -0.041559 -0.172661 -0.030896 -0.053806 0.007900 -0.088226 -0.035947 -0.003791
polarizability: 4.06601143e+02 -8.04695196e+00 2.24181047e+02 -1.21813650e+01 -3.21220084e+00 1.31922766e+02
1716.lowfreq: -8.7051 -5.9957 -2.6185 -0.0006 -0.0004 -0.0003 31.0693 48.1931 51.6144
frequency: 30.8719 48.1833 51.5832 60.1149 98.2186 118.0901 128.2519 139.9862 162.3771 203.7440 247.9761 265.0227 290.9709 294.9941 312.7619 338.2058 377.6584 438.0831 442.4082 477.3419 480.9956 490.5271 519.5207 555.2788 571.3309 575.2571 582.9303 618.1338 643.0891 654.5010 662.4267 681.0863 720.5085 754.8470 758.1810 764.2723 770.9171 777.5064 842.1097 854.9715 861.9721 868.4027 877.4376 910.4934 941.3130 943.2554 955.9048 976.5007 980.8501 998.9781 1010.7569 1014.3534 1021.6658 1036.5962 1042.0291 1086.8526 1102.3198 1144.8151 1158.8114 1171.2703 1183.2840 1212.4246 1233.7924 1243.7055 1252.5192 1287.0736 1313.3543 1345.1022 1354.3326 1395.0606 1401.1105 1404.8184 1414.5039 1425.8176 1437.9423 1448.6229 1455.3773 1458.8333 1460.9504 1465.6406 1473.1340 1484.8710 1494.8783 1543.9742 1586.9819 1590.9602 1617.3841 1629.2506 1632.3887 2973.9092 2984.4235 3044.8931 3049.1716 3060.5963 3093.5129 3105.6928 3113.5115 3128.5267 3130.0813 3137.8613 3149.5183 3151.6403 3165.1265 3166.9261 3594.3041
redmass: 3.7593 3.2792 1.1796 4.6611 1.5278 2.2602 3.6106 3.9521 3.6647 3.4765 3.6939 3.3570 4.0020 4.1107 4.5103 3.6097 3.4435 3.1761 3.1217 4.9888 5.5430 4.7651 3.5721 1.2076 3.9604 3.3203 5.3928 5.8387 5.1782 4.6783 5.4127 3.2823 4.5276 1.9599 1.6519 1.7452 4.0671 4.5458 4.2309 4.6598 1.4018 1.6343 2.4298 2.7099 1.4222 1.3709 3.1611 1.3198 1.3105 1.8202 1.9864 1.9257 2.0684 1.4919 1.5226 2.3010 2.1607 1.7788 1.2096 1.2537 2.2654 3.0463 1.5263 2.0444 2.6470 1.6298 2.4207 2.8021 1.5807 1.8998 1.4813 2.0090 2.6366 2.8237 1.6403 2.1032 2.6345 1.2384 1.2703 2.5941 1.4420 2.2226 2.5096 4.9431 6.3582 6.7189 7.6891 7.0233 8.2260 1.0395 1.0373 1.0865 1.0961 1.0959 1.0971 1.0990 1.0874 1.0857 1.0886 1.0893 1.0944 1.0950 1.0989 1.1002 1.0804
irintensity: 0.0929 2.1083 0.0836 0.7252 2.0374 0.7849 2.5245 1.8023 1.3648 1.6112 9.4828 2.0382 2.7689 3.7408 2.0149 5.3780 20.4825 4.5516 9.2596 5.6828 0.7076 1.4371 2.8054 76.7381 6.9788 8.4885 17.1080 3.0812 2.5054 12.0924 2.6683 32.5259 4.6358 81.7056 41.6147 67.3898 7.1763 11.2253 2.8335 0.7510 2.3833 3.7061 13.0467 35.4655 3.0632 2.7321 13.7933 0.2540 0.1772 3.8686 5.7459 6.0752 8.0687 7.9622 4.3541 5.8433 0.4360 1.5119 12.9354 5.1092 29.3404 18.5645 12.2167 40.6467 58.2585 2.2526 13.9485 127.8447 104.3886 6.1791 9.5200 26.6497 21.7761 291.2045 12.1530 14.3012 7.9097 18.6537 28.0149 31.8866 1.6347 12.1908 39.7249 29.8339 18.5358 11.7877 1.6978 1.1093 298.3697 42.1528 12.6834 22.6206 13.6290 10.4358 16.0072 11.0654 5.9938 1.0962 10.3743 7.7128 32.9413 24.2084 40.1616 24.7196 92.0205
temp: 298.150 k
press: 1.00000 atm
elementType: 7 7 6 6 6 6 6 6 6 6 6 6 6 6 6 6 6 6 6 6 6 1 1 1 1 1 1 1 1 1 1 1 1 1 1 1 1
symmnumber: 1
zpe: 772833.1 jmol-1
zpe.correction: 0.294357 hartree
zpe.thermalcorrener: 0.311942 hartree
zpe.thermalcorrenthalpy: 0.312886 hartree
zpe.thermalcorrgfe: 0.248171 hartree
zpe.sumelectzpe: -841.694911 hartree
zpe.sumelectthermal: -841.677326 hartree
zpe.sumelectthermalent: -841.676381 hartree
zpe.sumelectthermalfe: -841.741096 hartree
dipole: -5.7060 4.6317 -0.4809
dipole: 7.3650
quadrupole: -105.2054 -109.8966 -127.4021
quadrupole: -4.3562 -8.5448 4.0698
quadrupole: 8.9626 4.2714 -13.2340 -4.3562 -8.5448 4.0698
hfenergy: -841.9892675 hartree
pointgroup: C01 [X(C19H16N2)]
dipole: 2.1000754 1.6674457 1.0979391 debye
polarizability: 402.8744997|30.7184813|201.7272023|-8.3534306|41.2733974|158.1032534 unknown
InChI: InChI=1S/C19H16N2/c1-12-16(14-7-3-5-9-18(14)20-12)11-17-13(2)21-19-10-6-4-8-15(17)19/h3-11,20H,1-2H3
charge 0 multiplicity 1
37 atoms
N  3.33954 1.805097 0.548501
N  -2.293543 -0.924698 -1.887827
C  1.22121 0.954285 0.442495
C  2.173845 -0.117545 0.141423
C  1.988563 2.11217 0.714564
C  -1.160827 0.16184 -0.125599
C  3.491204 0.449223 0.211882
C  -0.221575 0.877019 0.595467
C  -2.566972 -0.039582 0.290221
C  -1.105029 -0.432486 -1.503653
C  -3.199769 -0.733365 -0.790529
C  2.04438 -1.511511 -0.083944
C  4.662583 -0.310397 0.013452
C  1.542084 3.502323 1.060364
C  -3.289721 0.262429 1.460143
C  3.208711 -2.282997 -0.275489
C  0.035513 -0.361266 -2.480595
C  4.503238 -1.688585 -0.242202
C  -4.547438 -1.125291 -0.722008
C  -4.65345 -0.122159 1.531251
C  -5.272585 -0.80923 0.455276
H  -0.625406 1.455004 1.444228
H  4.101352 2.473335 0.652109
H  1.056439 -1.983357 -0.09152
H  5.659308 0.141373 0.068092
H  1.534501 4.16439 0.172522
H  0.514173 3.490846 1.458517
H  2.198095 3.966617 1.819992
H  -2.82227 0.777385 2.308662
H  3.119096 -3.360372 -0.451716
H  -0.355035 -0.54128 -3.494899
H  0.819022 -1.111854 -2.272128
H  0.531423 0.6261 -2.445995
H  -5.013102 -1.657189 -1.557679
H  5.388378 -2.313674 -0.402564
H  -5.235879 0.110293 2.429975
H  -6.325856 -1.10099 0.53761
