program: Gaussian 09
title: 000253630
version: EM64L-G09RevD.01
frameworkgroup: C1[X(C20H18N2)]
method: RPBEPBE
basis: SDD
operation: Freq
keyword: #pfreq=noraman
keyword: PBEPBE/SDD
title: #p freq=noraman PBEPBE/SDD
converged: YES YES NO NO
title: Mulliken charges:
elementType: N N C C C C C C C C C C C C C C C C C C C C H H H H H H H H H H H H H H H H H H
charge: -0.446302 -0.070643 0.096012 0.207972 0.145693 0.126165 0.158774 0.210127 0.160626 -0.013332 -0.056892 -0.854534 -0.396503 -0.797143 -0.364789 -0.354844 -0.793538 -0.263645 -0.347818 -0.219651 -0.279599 -0.225258 0.306214 0.261097 0.235945 0.245213 0.244454 0.235705 0.280244 0.232696 0.231592 0.235704 0.254365 0.243716 0.226945 0.224429 0.250723 0.225100 0.220632 0.224350
chargesum: 0.00000
title: Mulliken charges with hydrogens summed into heavy atoms:
elementType: N N C C C C C C C C C C C C C C C C C C C C
charge: -0.140088 -0.070643 0.096012 0.207972 0.145693 0.126165 0.158774 0.210127 0.160626 -0.013332 -0.056892 -0.112279 -0.152049 -0.048498 -0.133197 -0.119140 -0.068512 -0.039216 -0.097095 0.005449 -0.058967 -0.000908
polarizability: 4.19476305e+02 7.53685911e-01 2.08235663e+02 -5.59273403e+00 1.34087788e+00 1.51318322e+02
1716.lowfreq: -5.9999 -3.1403 -0.0008 -0.0007 0.0003 4.9947 30.6419 41.3087 66.7683
frequency: 30.6178 41.2427 66.7585 98.5478 107.4084 136.2220 138.2473 153.7928 166.3661 177.9055 184.7265 227.1463 250.5958 279.3020 287.6510 300.1202 309.1331 341.1929 361.3689 432.9408 438.1972 453.2747 479.5327 483.2666 487.7192 545.2097 565.2540 573.6026 578.3724 583.0810 590.4259 636.1837 654.9997 664.8410 669.9714 693.8431 752.6577 762.9970 765.2809 767.9142 776.5522 848.6713 854.3147 856.2479 873.0106 908.2648 924.0139 934.4558 942.3638 974.2500 978.3878 990.5198 1000.7947 1014.2126 1020.3651 1022.3097 1032.0034 1036.5262 1044.2334 1064.5453 1099.4873 1113.3141 1159.7691 1166.5215 1188.9880 1198.9158 1212.7946 1237.0118 1259.8200 1264.7358 1306.4585 1315.7352 1336.2550 1387.5269 1389.9894 1400.2295 1401.5265 1415.6533 1422.8185 1435.6856 1447.8864 1453.6116 1458.9912 1462.2576 1464.6536 1470.6891 1472.0372 1476.2179 1482.5012 1495.0526 1556.3531 1580.1659 1586.3407 1605.2645 1617.0656 1630.0365 2968.4226 2970.5601 2988.8862 3038.3105 3053.5202 3067.8733 3103.9806 3107.3727 3107.7857 3126.1215 3127.2928 3135.3482 3143.9204 3148.7197 3160.9525 3165.5933 3170.2881 3596.4028
redmass: 4.5468 4.5963 4.2648 3.5688 1.1495 2.9896 3.0983 2.0605 3.9543 4.4691 1.3783 1.0779 3.4904 3.5501 3.9457 3.6452 3.4837 3.7819 4.2658 2.9721 3.3829 3.9302 5.0002 5.1314 4.5677 1.2083 3.8026 3.6634 3.3546 4.8973 4.2675 6.4613 5.6317 5.1075 4.4992 3.4621 1.3754 1.5428 3.8194 3.6846 3.8486 5.6843 1.5729 3.6865 1.4346 4.0942 4.4535 1.3835 1.4151 1.3029 1.3173 1.6495 1.7913 1.9946 1.6575 2.0598 3.7073 1.5893 1.4978 2.0627 1.9603 1.7341 1.2834 1.1310 2.4100 2.5104 3.1949 1.4073 2.8758 2.4784 2.4099 2.3689 2.5751 1.2301 1.5556 1.6580 2.2339 2.4975 2.9402 1.5921 2.1782 2.4542 2.2210 1.4300 1.1227 1.0893 1.2699 1.1264 2.2322 2.8521 5.4244 6.6456 6.2514 8.1955 7.6986 6.9237 1.0428 1.0399 1.0370 1.0975 1.0906 1.0954 1.0999 1.0988 1.0952 1.0853 1.0853 1.0892 1.0907 1.0952 1.0948 1.1002 1.0979 1.0804
irintensity: 0.1575 0.9863 1.6310 1.3533 0.8562 2.9208 3.9657 1.4061 0.7651 0.8184 1.9405 0.9425 0.3916 2.1882 0.7084 0.5210 8.5391 0.8409 0.9754 6.3675 4.9447 6.4626 0.4300 1.9031 0.6033 80.4351 0.2187 0.5500 11.4945 20.6662 2.6537 0.2912 15.2475 2.0284 8.7555 20.8158 91.0457 61.7555 9.4447 11.7195 8.0502 1.0698 0.2206 1.7119 1.9564 0.7121 4.9114 2.3742 2.8564 0.0233 0.4045 3.5745 6.1219 30.6358 24.1202 7.8854 3.4516 4.1918 4.0912 15.6765 5.7517 2.2038 3.1373 3.0743 27.4345 9.2408 19.4503 6.1271 10.9413 62.3297 66.9391 28.7658 54.9624 45.1929 4.6132 3.6087 22.7325 21.7472 216.2077 56.9946 9.2827 10.9389 13.6772 47.3335 11.0924 23.5767 12.8390 4.4685 15.9957 58.4606 47.5987 48.3751 0.6228 200.3913 11.4224 4.7356 10.6838 40.8557 20.2702 17.2921 11.0554 17.3218 13.6210 18.3899 4.1179 1.7243 1.2423 5.0427 20.3293 29.9346 29.5136 33.3813 30.8523 70.7952
temp: 298.150 k
press: 1.00000 atm
elementType: 7 7 6 6 6 6 6 6 6 6 6 6 6 6 6 6 6 6 6 6 6 6 1 1 1 1 1 1 1 1 1 1 1 1 1 1 1 1 1 1
symmnumber: 1
zpe: 846284.2 jmol-1
zpe.correction: 0.322333 hartree
zpe.thermalcorrener: 0.341186 hartree
zpe.thermalcorrenthalpy: 0.342130 hartree
zpe.thermalcorrgfe: 0.275703 hartree
zpe.sumelectzpe: -880.920332 hartree
zpe.sumelectthermal: -880.901478 hartree
zpe.sumelectthermalent: -880.900534 hartree
zpe.sumelectthermalfe: -880.966961 hartree
dipole: 4.3013 0.2149 3.2443
dipole: 5.3919
quadrupole: -120.9883 -119.5407 -129.9519
quadrupole: 13.4056 -1.9084 7.1006
quadrupole: 2.5053 3.9529 -6.4583 13.4056 -1.9084 7.1006
hfenergy: -881.2426644 hartree
pointgroup: C01 [X(C20H18N2)]
dipole: 1.7018814 1.0796558 0.661775 debye
polarizability: 418.1989848|-14.0322826|166.8867044|10.3037413|-25.7368467|193.9446006 unknown
InChI: InChI=1S/C20H18N2/c1-12(19-13(2)21-17-10-6-4-8-15(17)19)20-14(3)22-18-11-7-5-9-16(18)20/h4-11,21H,1-3H3
charge 0 multiplicity 1
40 atoms
N  3.024568 1.591516 -0.557572
N  -2.46039 -0.155505 -2.103055
C  1.25429 0.421514 0.283399
C  -0.105733 0.093755 0.736982
C  -1.208513 0.065536 -0.109626
C  2.48656 -0.303863 0.592913
C  1.631155 1.586152 -0.419621
C  3.577765 0.449508 0.040211
C  -2.646788 0.050101 0.254274
C  -1.217683 -0.070527 -1.607818
C  -3.356748 -0.04513 -0.99081
C  -0.261955 -0.135077 2.23441
C  2.766214 -1.542147 1.228126
C  0.813369 2.74638 -0.906503
C  4.919097 0.022577 0.123055
C  -3.379627 0.164554 1.457131
C  -0.041522 -0.262261 -2.529831
C  4.104079 -1.97579 1.320708
C  -4.759964 -0.03602 -1.051637
C  5.170202 -1.201211 0.778498
C  -4.797285 0.172388 1.400661
C  -5.481038 0.072277 0.16377
H  3.555323 2.339661 -1.000093
H  0.71138 -0.338117 2.707464
H  -0.668379 0.776025 2.718719
H  -0.955343 -0.964742 2.458265
H  1.956631 -2.161107 1.629589
H  0.852572 2.848071 -2.008588
H  -0.242944 2.611652 -0.627479
H  1.167605 3.700998 -0.472009
H  5.738346 0.608938 -0.30766
H  -2.88864 0.248553 2.430391
H  -0.403447 -0.728334 -3.460652
H  0.735866 -0.900486 -2.074703
H  0.442822 0.694425 -2.797838
H  4.331763 -2.92819 1.811776
H  -5.26821 -0.109695 -2.018275
H  6.199563 -1.566013 0.864426
H  -5.371315 0.255025 2.330548
H  -6.576848 0.079509 0.148155
