program: Gaussian 09
title: 000253588
version: EM64L-G09RevD.01
frameworkgroup: C1[X(C5H8N2O4)]
method: RPBEPBE
basis: SDD
operation: Freq
keyword: #pfreq=noraman
keyword: PBEPBE/SDD
title: #p freq=noraman PBEPBE/SDD
converged: YES YES NO NO
title: Mulliken charges:
elementType: O O O O N N C C C C C H H H H H H H H
charge: -0.321626 -0.214412 -0.300840 -0.170341 0.046420 -0.547583 -0.217825 0.158258 -0.676199 0.248125 -0.148465 0.235679 0.230252 0.217503 0.223010 0.230365 0.298238 0.327880 0.381564
chargesum: 0.00000
title: Mulliken charges with hydrogens summed into heavy atoms:
elementType: O O O O N N C C C C C
charge: -0.321626 -0.214412 -0.300840 -0.170341 0.046420 0.161861 0.248105 0.158258 -0.005321 0.248125 0.149773
polarizability: 1.15216919e+02 -5.56597129e+00 1.12787930e+02 -1.00628472e+00 -1.80491924e+00 4.48095629e+01
1716.lowfreq: -9.2210 -0.0012 -0.0012 -0.0011 2.5895 4.1579 22.7221 56.6089 70.1203
frequency: 22.1392 56.5841 70.1107 108.3452 117.9684 215.3549 245.1401 253.2420 281.7731 332.0042 365.3484 391.5106 407.1026 454.5536 593.6179 603.6051 670.2687 723.0644 733.4835 786.8678 799.5323 829.7906 842.1320 981.1409 997.5954 1032.5491 1081.4043 1110.8115 1137.2672 1148.5754 1244.6658 1250.1566 1313.9206 1336.4775 1357.9639 1372.6553 1399.8686 1464.8238 1474.9771 1487.7110 1525.5822 1634.4934 1653.2460 2994.5758 3011.5896 3069.6115 3091.6101 3105.2606 3180.0886 3308.8593 3622.0316
redmass: 3.5426 5.5058 5.3037 2.7786 4.0271 2.8512 4.3440 1.6472 4.3525 4.7530 2.8321 3.8859 11.4170 5.5591 6.1265 1.2676 10.4850 6.2277 7.1459 5.9752 1.1188 3.8554 1.4574 4.0781 1.1808 3.1844 1.8518 2.2449 1.4666 7.6384 4.5301 1.1555 1.5726 5.0812 1.5761 2.7963 1.2715 1.0407 1.0557 1.0716 1.3044 5.2989 7.2879 1.0357 1.0584 1.1061 1.0985 1.1029 1.0934 1.0587 1.0916
irintensity: 1.1514 0.6850 0.7329 5.7633 4.6831 0.7286 0.5988 2.2377 5.2930 7.3885 4.3740 4.8940 0.6269 3.6997 8.0341 159.6997 7.0576 0.7416 3.8390 24.1910 3.8388 4.2321 119.4862 163.5955 49.7648 229.8701 205.6915 4.7441 5.3525 12.5285 267.5999 6.5866 21.8328 128.8423 15.0880 143.6386 22.1225 12.6817 5.5338 11.8233 31.6915 44.8335 588.6196 20.3512 18.9938 4.8531 30.0403 48.0866 0.9766 76.8806 96.3733
temp: 298.150 k
press: 1.00000 atm
elementType: 8 8 8 8 7 7 6 6 6 6 6 1 1 1 1 1 1 1 1
symmnumber: 1
zpe: 366613.9 jmol-1
zpe.correction: 0.139636 hartree
zpe.thermalcorrener: 0.151209 hartree
zpe.thermalcorrenthalpy: 0.152153 hartree
zpe.thermalcorrgfe: 0.100483 hartree
zpe.sumelectzpe: -604.795565 hartree
zpe.sumelectthermal: -604.783993 hartree
zpe.sumelectthermalent: -604.783048 hartree
zpe.sumelectthermalfe: -604.834718 hartree
dipole: 3.3665 7.3243 -0.2239
dipole: 8.0641
quadrupole: -62.4821 -60.5076 -63.9081
quadrupole: -10.7127 0.7853 -1.1845
quadrupole: -0.1828 1.7917 -1.6089 -10.7127 0.7853 -1.1845
hfenergy: -604.9352012 hartree
pointgroup: C01 [X(C5H8N2O4)]
dipole: 1.291634 -2.8570438 0.484475 debye
dipolederiv: -1.7506825 0.1795193 0.0366262 0.4465341 -0.5346466 -0.051542 0.053188 -0.0294276 -0.3017885 -0.6379624 -0.230812 0.0117926 -0.0228866 -0.893578 -0.067229 0.0521683 -0.0496715 -0.3022228 -0.9515892 -0.1033148 0.0231948 -0.2379758 -0.4920669 0.0656536 0.0433475 0.0708093 -0.3322281 -0.3813139 0.1170772 -0.0270253 0.1111841 -0.8137999 0.1921446 -0.0274189 0.2083419 -0.262571 1.4221736 -0.3386755 0.0976476 -0.2836581 1.1733928 -0.3374654 0.0540852 -0.3439596 0.3278428 -0.6380054 -0.8109278 0.1324831 -0.3241531 -0.9512516 0.0603358 0.0477388 0.0119397 -0.5806008 1.0163594 -0.0180182 0.001398 0.1077489 0.2455392 -0.0012571 -0.0026164 0.0023136 0.3500603 -0.9008113 0.1509716 -0.0722437 -0.1233088 -1.0285768 0.1564234 -0.0348685 0.1653181 -0.1480019 -0.1063274 0.0825977 0.0091236 0.0604893 -0.0100208 -0.0153133 0.0048235 -0.0159908 0.0665234 2.0161494 0.2693448 -0.0580043 -0.1643576 1.2158686 0.1506198 -0.1066075 0.0819136 0.2769579 0.3494874 0.711131 -0.1228392 0.3821486 1.3290385 -0.2063249 -0.0036552 -0.1684133 0.127567 -0.0478463 0.0307468 -0.0136575 -0.0604617 -0.0159648 0.0903591 0.0166854 0.0937629 -0.0282401 -0.0638003 0.0231029 0.0165492 -0.0555192 0.0184671 -0.0824339 -0.0323419 -0.0913214 -0.0868439 -0.1543163 -0.0574658 -0.0069664 -0.076466 0.0554481 -0.0069174 -0.0091829 -0.0058297 0.1162864 0.1123374 -0.0337077 0.0417277 0.0308152 -0.0261329 0.1096499 0.0178656 0.1217574 -0.0420024 0.1162752 -0.0215714 -0.0447283 0.0323475 0.0277382 -0.0906381 -0.0100808 -0.1016917 -0.0888119 0.1125719 0.044501 -0.015506 0.0843497 0.1196056 0.0120482 -0.0263184 0.0153867 0.1547436 0.2137083 0.0237927 -0.0126049 0.0489505 0.2488927 0.0226528 -0.0288655 0.0210537 0.3740762 0.2735923 -0.0182919 0.003033 0.0442191 0.3320475 -0.0007663 -0.007946 0.0137085 0.3792536 unknown
polarizability: 115.3011122|5.7623338|111.0407128|1.151078|-10.5191869|46.4725867 unknown
InChI: InChI=1S/C5H8N2O4/c1-2-11-5(8)4(3-6)7(9)10/h3H,2,6H2,1H3
charge 0 multiplicity 1
19 atoms
O  1.627242 -0.299126 -0.068156
O  0.748236 1.859818 0.073378
O  -3.10162 -0.030775 -0.118309
O  -1.934647 1.85385 -0.647289
N  -1.960205 0.628985 -0.269872
N  -1.858902 -2.27203 0.29568
C  2.991864 0.30463 0.00862
C  -0.736177 -0.102505 -0.021533
C  3.98946 -0.84047 -0.132502
C  0.55725 0.628171 -0.00808
C  -0.763923 -1.484804 0.218298
H  3.086182 1.050872 -0.800259
H  3.086375 0.833244 0.974674
H  5.019661 -0.442603 -0.089897
H  3.870771 -1.576043 0.682019
H  3.859632 -1.360244 -1.097227
H  0.21304 -1.957265 0.349665
H  -1.775028 -3.273279 0.462973
H  -2.770713 -1.794626 0.186918
