program: Gaussian 09
title: 000253620
version: EM64L-G09RevD.01
frameworkgroup: C1[X(C21H19NO2)]
method: RPBEPBE
basis: SDD
operation: Freq
keyword: #p
keyword: freq=noraman
keyword: PBEPBE/SDD
title: #p freq=noraman PBEPBE/SDD
converged: YES YES NO NO
title: Mulliken charges:
elementType: O O N C C C C C C C C C C C C C C C C C C C C C H H H H H H H H H H H H H H H H H H H
charge: -0.229286 -0.273225 -0.468246 -0.393009 0.573488 0.055352 0.467324 0.327938 -0.376905 -0.430122 -0.456095 -0.331373 -0.227790 -0.235198 -0.330489 -0.347069 -0.242726 -0.324230 -0.369870 0.312452 -0.252794 -0.234714 -0.224201 -0.538122 0.250692 0.327922 0.252982 0.222145 0.218929 0.239203 0.226074 0.226986 0.226262 0.277401 0.229887 0.234231 0.241369 0.233951 0.235669 0.235747 0.215353 0.214835 0.239271
chargesum: 0.00000
title: Mulliken charges with hydrogens summed into heavy atoms:
elementType: O O N C C C C C C C C C C C C C C C C C C C C C
charge: -0.229286 -0.273225 -0.140323 -0.142317 0.573488 0.055352 0.467324 0.327938 -0.123923 -0.207977 -0.237166 -0.092170 -0.001716 -0.008212 -0.104227 -0.069668 -0.012839 -0.089999 -0.128502 0.312452 -0.018842 0.000955 0.011546 0.131337
polarizability: 3.31528074e+02 8.50219799e-01 1.97701733e+02 -9.50158279e+00 2.63467132e+01 2.09783064e+02
1716.lowfreq: -2.9681 -0.0008 -0.0006 -0.0002 4.2069 10.4731 16.2653 23.4199 32.3860
frequency: 16.0271 23.3016 32.3575 41.3052 55.0615 65.3366 72.1278 93.3944 133.9849 143.9063 165.2492 181.7452 201.5035 223.0926 240.5396 255.3002 300.1517 339.7464 365.6179 398.4986 404.2933 410.6976 420.9656 428.2999 451.9122 478.0940 510.1552 515.8654 539.1015 552.5213 608.1513 614.0441 616.4812 644.9855 648.4884 683.9078 695.2000 705.3990 711.1027 720.6642 762.4299 771.8601 790.1848 805.2372 807.8049 838.9116 848.5676 857.4843 880.7203 910.3570 925.0841 930.5696 944.2272 975.3982 982.1443 987.9540 989.6543 990.1510 992.2704 996.3811 1001.3095 1010.4931 1024.3173 1029.2689 1078.4145 1089.0819 1111.3787 1112.2375 1137.5062 1157.3016 1171.6184 1174.4898 1175.9417 1178.9349 1185.5881 1192.8106 1207.6512 1221.6259 1257.8311 1284.1190 1307.2137 1315.2686 1326.7968 1346.8552 1371.8136 1387.5927 1388.8472 1424.9107 1435.2197 1436.5465 1442.2617 1464.2552 1469.6995 1475.7529 1478.0323 1482.4594 1516.1290 1558.2174 1584.1556 1594.5682 1597.4100 1607.3566 1611.4811 1640.9141 2946.4956 2947.3028 3029.0887 3100.1884 3115.5200 3118.9558 3124.6773 3131.5121 3134.6250 3142.8560 3146.0132 3148.5177 3154.8863 3156.0258 3163.5745 3164.7571 3170.5520 3173.5503 3499.3260
redmass: 5.1407 3.8166 5.4150 3.9654 4.3702 4.3301 3.8495 6.2824 5.3968 4.9231 4.7201 5.7610 4.0469 3.2237 2.4631 1.7874 4.0999 7.4162 5.9015 2.7680 2.8203 2.9845 4.2161 4.4993 5.4271 4.4269 2.2089 3.0885 1.3581 3.7170 5.5488 6.3788 6.3069 5.9901 6.1812 4.8621 1.6352 1.7281 3.3453 4.4073 2.3454 2.3464 1.2659 4.1977 1.8070 3.6711 1.2620 1.2621 3.6834 1.3868 1.5661 1.3582 1.4462 1.4008 4.3901 4.7997 1.6939 3.4413 4.1324 1.5022 3.4367 1.3472 2.3039 2.0139 1.6645 1.5899 1.2946 1.5036 2.7913 1.3394 1.3985 1.3005 1.2965 1.2763 1.1353 1.2200 1.4826 2.2922 2.6265 1.6864 1.3508 1.4612 1.4267 1.6370 3.9920 6.0259 8.2281 3.5363 1.3672 1.8074 2.1415 1.0511 1.7159 1.1182 2.1718 2.1794 2.9591 7.1124 6.0791 6.1916 5.9187 6.0301 6.1839 6.6810 1.0541 1.0600 1.1034 1.0884 1.0976 1.0893 1.0856 1.0854 1.0905 1.0886 1.0957 1.0870 1.0928 1.0940 1.1013 1.0957 1.0960 1.1002 1.0759
irintensity: 0.4486 0.6130 0.1714 1.5611 1.2034 0.3740 1.3748 2.7679 1.1364 0.5075 0.3629 3.5188 4.0144 3.4738 2.6515 3.2539 4.1674 8.4768 0.3621 0.3267 0.4463 0.3965 3.7331 4.9564 0.8208 1.1416 9.0063 44.1520 76.0004 30.5762 30.3781 1.0850 6.6577 20.9929 5.3603 0.8137 74.7915 76.4560 2.0958 7.5160 27.2496 29.0514 4.6840 2.4007 94.6479 17.5226 0.1961 0.2416 0.3872 0.0755 0.5813 2.0550 4.7568 0.0044 59.5115 16.3543 1.0391 0.5783 3.8767 2.5640 64.9127 0.4186 6.1583 1.1061 9.7038 5.0657 3.6484 20.8333 12.5866 1.2063 43.5622 42.5166 30.3531 17.8004 6.7245 4.5360 42.5928 212.4599 181.9481 20.9613 1.9191 1.9713 29.1058 43.1684 42.6965 4.7996 1.9564 14.6967 0.8454 35.0953 12.1561 12.0050 84.7818 67.3565 13.3036 8.0305 631.4079 90.2437 0.2623 9.1980 13.9446 5.5577 10.9751 56.5081 126.9649 19.4711 58.4649 15.2912 42.9160 8.0673 0.3120 0.1754 8.8111 7.1761 25.7276 18.9008 16.7910 22.1026 27.2034 26.3398 7.8171 14.2852 129.1799
temp: 298.150 k
press: 1.00000 atm
elementType: 8 8 7 6 6 6 6 6 6 6 6 6 6 6 6 6 6 6 6 6 6 6 6 6 1 1 1 1 1 1 1 1 1 1 1 1 1 1 1 1 1 1 1
symmnumber: 1
zpe: 899173.5 jmol-1
zpe.correction: 0.342477 hartree
zpe.thermalcorrener: 0.363548 hartree
zpe.thermalcorrenthalpy: 0.364492 hartree
zpe.thermalcorrgfe: 0.289625 hartree
zpe.sumelectzpe: -1015.132209 hartree
zpe.sumelectthermal: -1015.111138 hartree
zpe.sumelectthermalent: -1015.110194 hartree
zpe.sumelectthermalfe: -1015.185062 hartree
dipole: -2.8160 0.4394 0.8479
dipole: 2.9736
quadrupole: -116.1719 -137.7848 -132.8577
quadrupole: -5.4132 -13.6428 1.6518
quadrupole: 12.7662 -8.8467 -3.9195 -5.4132 -13.6428 1.6518
hfenergy: -1015.4746864 hartree
pointgroup: C01 [X(C21H19N1O2)]
dipole: 1.0776509 -0.1294044 0.4365402 debye
polarizability: 330.0981124|-5.4220524|182.6937176|13.7133509|-17.6557437|226.2210405 unknown
InChI: InChI=1S/C21H19NO2/c1-24-19-14-12-18(13-15-19)22-20(16-8-4-2-5-9-16)21(23)17-10-6-3-7-11-17/h2-15,20,22H,1H3
charge 0 multiplicity 1
43 atoms
O  1.68664 1.020869 -2.277507
O  -6.107599 1.083457 0.451303
N  -0.675515 0.780675 -1.143939
C  0.436715 0.457258 -0.269546
C  0.531555 -1.043963 0.106156
C  1.740596 0.848298 -1.021831
C  -2.019068 0.84013 -0.753814
C  3.032938 0.982132 -0.28381
C  0.553676 -2.019548 -0.920644
C  0.577528 -1.461298 1.456731
C  -3.004615 1.253997 -1.69274
C  -2.451376 0.512263 0.56606
C  0.626916 -3.391628 -0.599169
C  0.647048 -2.834614 1.782043
C  3.117658 1.035867 1.133741
C  4.225934 1.090053 -1.051925
C  0.675596 -3.803985 0.753792
C  -4.366782 1.346714 -1.337467
C  -3.808799 0.608834 0.923542
C  -4.776087 1.026047 -0.019675
C  4.368084 1.192267 1.766956
C  5.473964 1.239681 -0.41891
C  5.548795 1.291164 0.994455
C  -7.12846 1.504623 -0.50407
H  0.374333 1.041655 0.673792
H  -0.409591 1.023934 -2.102519
H  0.49757 -1.698485 -1.967355
H  0.545087 -0.714697 2.261909
H  -2.698916 1.51199 -2.714404
H  -1.73413 0.158483 1.311799
H  0.643418 -4.139631 -1.399786
H  0.670387 -3.147367 2.832004
H  2.214633 0.973676 1.747773
H  4.142868 1.05521 -2.143015
H  0.727908 -4.869609 1.003224
H  -5.089292 1.670527 -2.093182
H  -4.140374 0.353794 1.935155
H  4.42341 1.238872 2.859741
H  6.386677 1.317852 -1.019235
H  6.519054 1.410667 1.489352
H  -7.18907 0.811753 -1.367539
H  -6.941278 2.533154 -0.873467
H  -8.076636 1.480829 0.054023
