program: Gaussian 09
title: 000253606
version: EM64L-G09RevD.01
frameworkgroup: C1[X(C15H8Cl6O3)]
method: RPBEPBE
basis: SDD
operation: Freq
keyword: #p
keyword: freq=noraman
keyword: PBEPBE/SDD
title: #p freq=noraman PBEPBE/SDD
converged: YES YES NO NO
title: Mulliken charges:
elementType: Cl Cl Cl Cl Cl Cl O O O C C C C C C C C C C C C C C C H H H H H H H H
charge: -0.023031 -0.023049 -0.023057 -0.023039 -0.019097 -0.019097 -0.228834 -0.228834 -0.272911 0.659814 0.659816 -0.411201 -0.411202 -0.272589 -0.272631 -0.272634 -0.272592 -0.227456 -0.227415 -0.227414 -0.227454 -0.083999 -0.084000 0.346296 0.257607 0.257575 0.257561 0.257621 0.288802 0.288819 0.288820 0.288803
chargesum: 0.00000
title: Mulliken charges with hydrogens summed into heavy atoms:
elementType: Cl Cl Cl Cl Cl Cl O O O C C C C C C C C C C C C C C C
charge: -0.023031 -0.023049 -0.023057 -0.023039 -0.019097 -0.019097 -0.228834 -0.228834 -0.272911 0.659814 0.659816 0.103981 0.103981 -0.272589 -0.272631 -0.272634 -0.272592 0.061346 0.061404 0.061406 0.061349 -0.083999 -0.084000 0.346296
polarizability: 2.72743238e+02 -7.95350491e-03 2.48033233e+02 4.16458546e-05 9.24136418e-02 1.87591895e+02
1716.lowfreq: -7.3203 -6.1999 -3.3308 -2.2328 -0.9289 -0.0014 -0.0014 0.0011 10.0124
frequency: -7.0759 -4.3957 10.0118 16.8710 33.1970 44.4506 63.2978 80.5994 116.2034 119.4584 140.9170 161.0013 166.8453 175.1605 176.4890 191.1972 193.6215 193.6326 207.9557 238.8880 295.8346 314.0511 317.0404 346.0533 346.2025 354.0988 411.0069 411.0673 416.2703 425.1244 488.3400 492.8595 492.9535 519.0913 519.0968 556.6396 572.6257 633.2770 689.3537 692.6709 694.1921 730.2157 741.0423 742.6779 761.0708 831.1703 850.2386 858.4918 858.7187 866.3509 866.3944 866.5815 895.3019 959.4400 961.6741 1012.5097 1051.9460 1053.3865 1111.2997 1113.1432 1166.2398 1175.7174 1177.8734 1221.8985 1224.3369 1224.6068 1225.7862 1357.6243 1361.9328 1362.3302 1369.4348 1369.5448 1371.6108 1438.6825 1439.6669 1462.8781 1463.7761 1555.4900 1556.1110 1586.2169 1586.3572 1619.9560 3042.3366 3042.3709 3109.7841 3110.1604 3190.0946 3190.0979 3191.7047 3191.7072
redmass: 13.2069 18.9931 19.1918 18.1775 23.7350 14.9516 23.2671 10.0486 14.4270 13.2560 12.4143 8.6800 12.0517 23.6811 19.4845 17.7724 4.7061 4.7054 20.3754 16.9721 8.4419 2.6769 2.7254 31.5160 32.9122 8.0281 8.2294 8.2280 8.3631 9.6965 8.4915 3.8629 3.8297 5.1708 5.1696 4.4065 3.8948 10.6671 5.1052 5.9392 11.8237 7.5548 9.0394 9.1365 10.2936 6.5019 6.3338 1.4669 1.4503 1.3664 1.3660 7.8556 10.0505 1.6658 1.6700 13.2872 2.9410 2.9579 3.3652 3.3223 6.4764 1.3954 1.4133 1.1547 2.6518 1.1466 2.5705 1.3308 3.7576 3.8039 5.7875 5.6619 1.4352 3.6099 3.6424 1.0825 1.0817 8.9318 8.9089 8.9623 8.9364 10.7361 1.0576 1.0577 1.1077 1.1078 1.0935 1.0935 1.0944 1.0944
irintensity: 0.0000 0.0241 0.0000 0.0535 0.0178 0.4758 0.0005 1.7818 0.0120 0.3383 0.1337 0.0269 0.0000 0.8269 0.0000 0.4615 0.0000 0.0055 0.2125 13.2187 0.0440 0.0002 7.4537 0.0750 0.0001 26.5595 0.0000 13.4530 14.7389 39.4982 1.0854 0.0001 2.3295 0.0014 0.0000 1.8278 19.4408 6.6715 12.6543 7.1690 8.7384 24.2467 0.0002 127.7952 2.4266 29.2110 64.8492 84.8965 46.7342 0.0685 0.0098 260.9255 22.7481 0.0001 38.2801 10.8435 12.9843 11.1629 89.0128 6.4644 1354.5684 0.0655 28.5293 0.0018 6.0309 3.1637 1.0621 40.8389 0.0002 55.8700 0.0017 38.4241 0.5498 34.4046 53.1207 6.4741 38.5298 0.0004 194.1343 172.2523 133.9307 288.7835 10.1692 14.0466 0.0001 2.5221 1.9547 4.4913 0.7478 1.0035
temp: 298.150 k
press: 1.00000 atm
elementType: 17 17 17 17 17 17 8 8 8 6 6 6 6 6 6 6 6 6 6 6 6 6 6 6 1 1 1 1 1 1 1 1
symmnumber: 1
zpe: 507429.7 jmol-1
zpe.correction: 0.193270 hartree
zpe.thermalcorrener: 0.215273 hartree
zpe.thermalcorrenthalpy: 0.216218 hartree
zpe.thermalcorrgfe: 0.137777 hartree
zpe.sumelectzpe: -3560.699167 hartree
zpe.sumelectthermal: -3560.677163 hartree
zpe.sumelectthermalent: -3560.676219 hartree
zpe.sumelectthermalfe: -3560.754660 hartree
dipole: 0.0000 -0.0025 0.2379
dipole: 0.2379
quadrupole: -164.0267 -174.9039 -184.6471
quadrupole: 0.0017 0.0000 0.0251
quadrupole: 10.4992 -0.3780 -10.1212 0.0017 0.0000 0.0251
hfenergy: -3560.8924369 hartree
pointgroup: C01 [X(C15H8Cl6O3)]
dipole: 0.0000114 0.0014748 -0.0935787 debye
polarizability: 272.7432379|0.0086725|248.0305987|-0.0001941|0.4096126|187.59453 unknown
InChI: InChI=1S/C15H8Cl6O3/c16-7-1-11(18)9(12(19)2-7)5-23-15(22)24-6-10-13(20)3-8(17)4-14(10)21/h1-4H,5-6H2
charge 0 multiplicity 1
32 atoms
Cl -3.436415 -2.810788 0.536899
Cl 3.428972 2.799543 0.586018
Cl -3.429834 2.800083 0.58472
Cl 3.436731 -2.811303 0.535558
Cl -6.912048 0.026579 -2.684571
Cl 6.911758 0.02831 -2.684588
O  -1.116277 -0.009498 0.765756
O  1.116005 -0.009989 0.765746
O  -0.00013 -0.025764 2.835902
C  -3.512082 -0.00477 0.500016
C  3.511809 -0.005241 0.499995
C  -2.41373 -0.01476 1.526898
C  2.413465 -0.015886 1.526877
C  -4.065251 -1.200078 -0.029498
C  4.06186 1.200563 -0.008533
C  -4.062385 1.200683 -0.009068
C  4.065225 -1.200187 -0.030075
C  -5.09243 -1.221915 -0.991589
C  5.088862 1.241867 -0.970134
C  -5.089404 1.241324 -0.970684
C  5.09241 -1.221361 -0.992178
C  -5.587506 0.014266 -1.44608
C  5.587223 0.015134 -1.446099
C  -0.000133 -0.016009 1.583844
H  -2.441187 0.879358 2.170285
H  -2.443026 -0.919727 2.154851
H  2.442693 -0.921305 2.15418
H  2.440994 0.877769 2.170906
H  -5.487495 -2.166113 -1.371796
H  5.481385 2.193554 -1.333875
H  -5.482129 2.19276 -1.334863
H  5.487674 -2.1653 -1.372822
