program: Gaussian 09
title: 000250719
version: EM64L-G09RevD.01
frameworkgroup: C1[X(C7H11N3O2)]
method: RPBEPBE
basis: SDD
operation: Freq
keyword: #p
keyword: freq=noraman
keyword: PBEPBE/SDD
title: #p freq=noraman PBEPBE/SDD
converged: NO YES NO NO
title: Mulliken charges:
elementType: O O N N N C C C C C C C H H H H H H H H H H H
charge: -0.284073 -0.282222 -0.228551 -0.208103 -0.409842 0.452115 0.234757 -0.420605 0.206355 -0.672008 -0.603170 -0.628395 0.258056 0.301941 0.233932 0.233298 0.335303 0.272782 0.243972 0.243820 0.247653 0.247078 0.225906
chargesum: 0.00000
title: Mulliken charges with hydrogens summed into heavy atoms:
elementType: O O N N N C C C C C C C
charge: -0.284073 -0.282222 -0.228551 -0.208103 -0.074539 0.452115 0.234757 -0.162548 0.206355 0.097163 0.157404 0.092241
polarizability: 1.38741593e+02 -5.78471958e+00 1.19509470e+02 -1.32013768e-02 4.11076847e-04 5.77177176e+01
1716.lowfreq: -9.3823 -0.0006 0.0000 0.0002 7.1968 9.9672 70.2538 105.1731 117.0754
frequency: 70.2480 105.1487 117.0668 120.9904 165.7218 180.0085 199.8921 222.2186 225.2088 295.7488 320.6103 337.5576 357.5485 390.3710 404.5977 464.7244 492.3198 598.3475 644.6193 673.4804 680.9985 706.5870 723.3529 782.0347 876.0322 961.5178 1036.5301 1062.8653 1123.2312 1126.1314 1130.6040 1151.4130 1182.8150 1197.3524 1240.7696 1252.1827 1283.8221 1339.8035 1355.7044 1422.6527 1432.8546 1443.5926 1467.2870 1476.7213 1478.3527 1481.8807 1498.6142 1502.8443 1537.8260 1575.5042 1636.4859 1655.3630 2968.7761 2970.6985 3007.6194 3042.0750 3053.0513 3098.5744 3107.7894 3112.5120 3134.0715 3223.2138 3610.0387
redmass: 3.5023 2.5910 1.3571 2.2135 1.3263 1.6392 3.2327 1.4891 3.7286 3.5577 2.8743 1.3270 3.6656 6.6589 5.8523 5.8189 6.3457 6.9307 4.2718 3.7015 4.6467 4.5267 6.3471 1.9946 3.0969 2.5303 3.7312 2.0703 1.2904 1.2850 1.3056 1.7641 2.0397 4.8061 3.0956 3.2911 2.2358 2.8273 2.2591 1.2863 1.2442 1.1749 1.0398 1.0654 1.0462 1.0960 1.0970 1.0448 2.3429 8.0616 8.7188 7.5936 1.0364 1.0361 1.0329 1.1017 1.1033 1.1022 1.0982 1.0958 1.1019 1.0920 1.0772
irintensity: 1.6816 0.6923 2.8457 4.4508 6.8877 7.2843 0.2029 1.7889 2.7928 22.8914 4.7837 76.6576 5.5440 18.3806 12.9193 10.5994 13.4061 12.8019 0.7389 2.5726 4.5377 0.6132 9.9963 58.6788 6.8791 43.9534 5.7427 21.6194 0.0017 0.9559 0.0790 4.6772 12.6743 32.6915 37.0121 7.3339 62.9503 70.2027 41.8854 89.2132 63.8515 34.9912 15.7000 5.9333 15.5721 61.4815 39.8950 19.4820 321.4280 281.1524 116.0690 829.2715 59.0978 51.3954 33.1647 31.0537 29.5031 21.2209 18.0854 2.1166 0.7816 2.2598 56.2917
temp: 298.150 k
press: 1.00000 atm
elementType: 8 8 7 7 7 6 6 6 6 6 6 6 1 1 1 1 1 1 1 1 1 1 1
symmnumber: 1
zpe: 481727.7 jmol-1
zpe.correction: 0.183480 hartree
zpe.thermalcorrener: 0.195949 hartree
zpe.thermalcorrenthalpy: 0.196893 hartree
zpe.thermalcorrgfe: 0.145396 hartree
zpe.sumelectzpe: -587.162044 hartree
zpe.sumelectthermal: -587.149576 hartree
zpe.sumelectthermalent: -587.148631 hartree
zpe.sumelectthermalfe: -587.200128 hartree
dipole: -6.7678 2.5649 -0.0094
dipole: 7.2375
quadrupole: -56.9538 -82.8627 -72.1786
quadrupole: -1.1033 0.0650 -0.0324
quadrupole: 13.7112 -12.1977 -1.5136 -1.1033 0.0650 -0.0324
hfenergy: -587.3455244 hartree
pointgroup: C01 [X(C7H11N3O2)]
dipole: -2.6569018 1.0241684 -0.0035663 debye
dipolederiv: -0.7686995 -0.3682529 0.0236608 -0.3301415 -1.1100215 0.0391697 0.0217784 0.0397873 -0.3813619 -0.8559037 0.3910841 -0.0092864 0.4099561 -1.1675119 0.0288828 -0.0102021 0.0289194 -0.3743011 -1.1527746 -0.4214134 0.036032 -0.0213955 -0.9559681 0.0358333 0.0200693 0.0406711 -0.1875302 -0.7253178 -0.0315863 0.0109952 -0.1222442 -1.338848 0.0535835 0.0128997 0.0523667 -0.2004866 -1.5199348 0.033989 0.019322 0.0954325 -0.4392234 -0.0072957 0.0248263 -0.0095195 -0.4643831 1.6508265 0.052714 -0.0296945 -0.4752028 1.1605851 -0.0320462 -0.006528 -0.039273 0.2143404 1.4530612 0.271899 -0.0335559 0.1561903 1.4987997 -0.0597579 -0.027865 -0.0621151 0.2691694 -1.0402543 0.3919257 -0.0057394 0.5146621 -0.5393809 -0.0016443 -0.0133457 0.0015723 -0.3623142 1.5500946 -0.290675 -0.0099558 -0.0704575 1.6134838 -0.0611529 -0.0199954 -0.0579356 0.2232191 0.0762609 -0.2264859 0.0134565 -0.2799965 0.348085 -0.0008851 0.0166025 -0.0018067 0.2419533 0.4201153 -0.0055775 -0.0045197 -0.0725667 0.0352004 0.0094766 -0.0010418 0.0085783 0.2109808 0.4031892 0.1035639 -0.0074511 0.3891342 0.3307974 -0.0082573 -0.0219827 -0.0041422 0.2655697 0.0140609 -0.0442661 0.0051004 -0.0743484 0.0238175 0.0091304 0.0066891 0.0088727 0.1979785 0.1505907 -0.1659546 0.0066781 -0.0169599 0.0991146 0.0020383 -0.0000617 0.0047055 0.1396498 -0.0113374 0.1259367 0.0978451 0.0515389 0.0477521 0.0222897 0.1071721 -0.0373515 -0.0614433 -0.0186045 0.1179214 -0.1104124 0.0412296 0.0468584 -0.0328125 -0.1136386 0.0249652 -0.0561586 0.1863594 0.0008888 0.002426 -0.0660103 0.1545321 0.0102984 0.0000855 0.0122256 0.3055236 0.16401 -0.0028438 -0.0002558 0.1506881 0.0170675 0.004468 -0.0071777 0.0062285 0.1264461 -0.0013781 -0.009084 -0.0246635 -0.0819673 0.0692327 -0.0983806 -0.0733763 -0.0644245 -0.0385034 -0.0001143 -0.0047066 0.024593 -0.0698107 0.0851284 0.0871545 0.0810949 0.0516179 -0.0597535 0.0787803 0.0246901 -0.0654157 -0.116246 -0.006846 0.0867985 0.0255054 0.0950154 -0.076705 0.078837 0.0264483 0.0572806 -0.1235386 -0.0257631 -0.0882542 -0.0209808 -0.1016894 -0.0614483 -0.1318671 0.029785 0.0035605 0.1120541 0.0531082 0.001363 -0.0005273 0.0027317 0.1295584 unknown
polarizability: 138.6540883|-5.9448238|119.4537528|-1.1638419|-2.6990554|57.8609397 unknown
InChI: InChI=1S/C7H11N3O2/c1-8-5-4-6(11)10(3)7(12)9(5)2/h4,8H,1-3H3
charge 0 multiplicity 1
23 atoms
O  1.656651 2.135631 -0.077021
O  1.462444 -2.548444 0.138321
N  -0.451985 1.107561 0.006923
N  1.560328 -0.197282 0.031921
N  -2.597846 0.096953 0.09105
C  -1.225421 -0.065252 0.072459
C  0.976868 1.069068 -0.016551
C  -0.606594 -1.311375 0.117492
C  0.827793 -1.450044 0.099978
C  -1.078993 2.44085 -0.042112
C  3.0383 -0.245446 0.010111
C  -3.515907 -1.042008 0.161676
H  -1.184872 -2.232094 0.168841
H  -0.260703 3.175255 -0.086163
H  -1.679035 2.636329 0.866548
H  -1.705329 2.558286 -0.946717
H  -2.991392 1.033485 0.042911
H  3.322264 -1.306924 0.063129
H  3.451064 0.310365 0.86814
H  3.422398 0.211455 -0.917042
H  -3.355981 -1.631661 1.084543
H  -3.390821 -1.717357 -0.706455
H  -4.552329 -0.668649 0.163817
