program: Gaussian 09
title: 000253577
version: EM64L-G09RevD.01
frameworkgroup: C1[X(C11H14)]
method: RPBEPBE
basis: SDD
operation: Freq
keyword: #p
keyword: freq=noraman
keyword: PBEPBE/SDD
title: #p freq=noraman PBEPBE/SDD
converged: NO NO NO NO
title: Mulliken charges:
elementType: C C C C C C C C C C C H H H H H H H H H H H H H H
charge: -0.446789 -0.557617 -0.546844 0.255647 0.247331 -0.566727 0.519876 -0.387956 -0.427032 -0.539782 -0.674520 0.223445 0.223514 0.225977 0.225495 0.225916 0.225952 0.241746 0.234127 0.228320 0.206293 0.206403 0.221972 0.213645 0.221608
chargesum: 0.00000
title: Mulliken charges with hydrogens summed into heavy atoms:
elementType: C C C C C C C C C C C
charge: 0.000170 -0.106145 -0.094976 0.255647 0.247331 -0.324981 0.519876 -0.153828 -0.198712 -0.127086 -0.017295
polarizability: 1.52865772e+02 2.08154172e-01 1.17008982e+02 -4.59392068e+00 2.72176626e+00 7.21040602e+01
1716.lowfreq: -131.5239 -11.0800 -0.0009 -0.0004 -0.0004 10.5474 15.7847 41.2819 91.4892
frequency: -131.5178 40.2636 91.4686 167.7996 206.1919 217.4655 290.9109 345.4951 407.9914 426.2137 464.7469 562.5919 582.5705 682.2981 708.7348 722.4066 742.0763 783.9996 795.4070 830.3706 884.8262 895.0448 915.3741 915.9685 951.7515 981.2375 1028.5385 1038.9300 1056.0664 1063.6944 1105.0172 1142.6106 1149.0166 1196.5722 1199.2689 1218.2226 1237.2791 1241.8682 1249.5591 1284.7557 1290.2273 1308.5049 1317.0881 1385.3021 1389.4447 1426.1621 1456.0672 1463.7899 1471.3900 1474.3387 1486.4453 1489.9129 1494.1982 1592.4221 1622.2721 2973.8803 2978.3839 2978.7583 2981.0377 3017.4990 3018.0080 3022.5031 3030.3338 3070.9495 3074.3178 3077.3552 3106.4217 3108.5288 3132.9941
redmass: 1.5888 2.4427 3.1776 2.4953 1.2322 3.3351 1.9453 3.5963 2.9124 2.7773 3.9278 4.3376 3.4905 5.8468 2.9341 2.7592 1.2376 1.5876 2.2721 1.3697 1.3845 3.5350 2.5359 1.5828 1.3565 2.2243 3.2609 1.7705 1.5524 2.0846 2.6982 1.1920 1.4737 1.4203 1.2040 1.3886 1.0691 1.3284 1.8801 1.4084 2.1580 1.4485 1.6121 4.6510 1.2261 3.7203 1.1534 1.0839 1.0433 1.0880 1.1662 1.1475 1.9759 6.8917 7.1043 1.0353 1.0597 1.0595 1.0597 1.0649 1.0997 1.1020 1.1013 1.0998 1.1047 1.1010 1.0909 1.0874 1.0967
irintensity: 0.4779 0.0459 1.5806 0.7357 0.2664 2.5538 0.6951 0.8679 1.9006 5.5361 0.1898 2.4355 3.4943 0.0067 1.8274 1.8238 6.5261 2.0142 1.4254 37.9011 10.1194 7.2239 0.1147 1.5457 0.1144 3.0822 0.6249 2.5685 2.1932 13.4662 4.7894 0.0032 3.4409 0.1622 0.0021 0.7454 0.0036 0.2740 0.2549 0.6024 1.5120 5.4322 3.6261 5.6913 9.4790 2.4448 2.6663 10.5056 14.0211 1.5036 16.1902 6.9015 25.3351 2.6637 3.9056 44.3914 7.0050 69.6309 38.9374 71.1893 25.0874 0.0237 9.2558 62.3533 55.6876 41.1022 16.9616 18.5158 26.2732
temp: 298.150 k
press: 1.00000 atm
elementType: 6 6 6 6 6 6 6 6 6 6 6 1 1 1 1 1 1 1 1 1 1 1 1 1 1
symmnumber: 1
zpe: 568603.9 jmol-1
zpe.correction: 0.216570 hartree
zpe.thermalcorrener: 0.226047 hartree
zpe.thermalcorrenthalpy: 0.226991 hartree
zpe.thermalcorrgfe: 0.181294 hartree
zpe.sumelectzpe: -426.763572 hartree
zpe.sumelectthermal: -426.754094 hartree
zpe.sumelectthermalent: -426.753150 hartree
zpe.sumelectthermalfe: -426.798847 hartree
dipole: -0.3489 -0.2954 0.0911
dipole: 0.4661
quadrupole: -60.4894 -62.4236 -69.3345
quadrupole: 0.1587 -0.9442 0.6578
quadrupole: 3.5931 1.6589 -5.2520 0.1587 -0.9442 0.6578
hfenergy: -426.9801414 hartree
pointgroup: C01 [X(C11H14)]
dipole: -0.1384413 -0.1149177 0.0354378 debye
dipolederiv: 0.1039953 0.0322343 0.0084309 0.0324056 -0.0047346 -0.0150113 0.0081449 -0.0150221 0.1562392 -0.0109683 -0.0025382 0.0179814 -0.0956807 0.0114745 0.0002311 0.0130315 -0.0123017 0.1677546 -0.0321829 -0.0390357 0.0185017 0.0654154 0.0507286 -0.013516 0.028234 -0.0058026 0.1726521 0.0167652 0.1365488 0.0035822 0.3307231 0.1249404 -0.0124186 0.0126316 0.000544 -0.0436514 0.1998351 -0.0716803 -0.0366351 -0.2528121 -0.1753568 0.0168788 -0.047419 -0.0003232 -0.0609669 -0.1564144 -0.0523707 -0.0224463 -0.0953105 0.0669533 0.0267799 -0.0119771 0.0170347 -0.1735875 0.261176 -0.0573683 0.0082917 -0.1457207 -0.0195825 0.0078815 0.0032391 0.0025302 -0.0833524 -0.0500843 0.0208251 -0.0144609 -0.0143929 0.1467014 0.0159615 -0.0177417 0.0177805 -0.1478475 -0.1507421 0.023006 -0.0186992 0.1636211 0.0017839 0.0035115 0.0118193 0.0161995 -0.1794075 0.0443987 0.0299764 -0.0315875 0.0344137 0.14194 0.0127241 -0.157925 0.0347125 0.1063656 -0.0175114 0.0208059 -0.0397821 0.0223735 0.0688173 0.0175157 0.0517753 0.0002366 -0.002285 -0.0257969 -0.0319939 0.0921244 -0.0400946 0.0447879 0.0420858 0.1574975 0.058274 -0.088469 -0.0809338 -0.0276478 -0.1019882 -0.0229272 0.0560035 -0.0187165 -0.1653384 -0.0347102 -0.0463318 0.0050323 -0.0334762 -0.0014312 -0.0241947 -0.0250178 -0.0992556 -0.0383283 -0.1489219 -0.0685929 0.0094255 -0.000203 -0.0152556 -0.0073133 -0.0614589 0.1014289 0.023345 0.1532733 -0.0348068 -0.0156469 0.0237615 0.0449061 0.0136748 0.0017458 -0.0883798 0.1080651 -0.1173201 -0.0838219 -0.0480679 0.0548824 -0.0489125 0.0478168 -0.0279897 0.0877082 -0.1088672 0.1150824 -0.0238621 0.0651855 0.0578415 0.0196053 0.0738271 -0.0988059 -0.0235105 0.0201398 -0.0226743 0.1328411 0.0564108 0.0711968 0.0124738 0.052329 -0.1154454 -0.0200821 0.0151089 -0.0241277 0.1447067 -0.0486916 -0.1245346 0.0186418 -0.1121951 -0.0106885 -0.0031634 0.0187762 0.0003706 0.1416523 0.0138958 -0.001242 -0.0170299 0.0680752 -0.0762788 -0.1385249 0.0214773 -0.0956172 -0.0354103 -0.0382931 -0.0373707 0.0451781 -0.1065235 -0.0612434 0.1230638 0.0479896 0.0723332 -0.0005124 0.1093951 0.0325479 0.0092237 -0.0102235 -0.071059 -0.1351236 -0.0053794 -0.0829988 -0.0217629 -0.2640699 0.0876279 -0.0092886 0.0953542 0.0822846 0.0059323 -0.0166963 0.0049783 0.0612732 0.0538884 -0.111793 0.058576 -0.072641 -0.0504997 0.1059992 0.0283972 0.06647 0.0111834 unknown
polarizability: 152.9778617|-0.0911768|117.072502|-3.4611303|2.153851|71.9284503 unknown
InChI: InChI=1S/C11H14/c1-2-9-6-7-10-4-3-5-11(10)8-9/h6-8H,2-5H2,1H3
charge 0 multiplicity 1
25 atoms
C  -3.218024 -0.611287 0.139752
C  -1.982095 -1.557169 -0.058893
C  -2.676134 0.860597 0.188862
C  -0.778665 -0.627249 -0.116365
C  -1.169421 0.729384 0.02243
C  0.578944 -0.966403 -0.288037
C  1.572321 0.049833 -0.321962
C  -0.195048 1.748511 -0.010978
C  1.167962 1.402996 -0.182873
C  3.046144 -0.311532 -0.464176
C  3.722729 -0.595664 0.902433
H  -3.755138 -0.860907 1.071612
H  -3.939964 -0.733903 -0.686651
H  -2.072108 -2.155483 -0.986328
H  -1.88841 -2.284027 0.771283
H  -2.933732 1.35775 1.144182
H  -3.116736 1.483076 -0.613941
H  0.879542 -2.016778 -0.400021
H  -0.483987 2.802034 0.08971
H  1.92761 2.194636 -0.214046
H  3.152694 -1.204327 -1.111069
H  3.586643 0.511694 -0.970565
H  3.661426 0.287972 1.564197
H  4.790208 -0.85539 0.773028
H  3.22534 -1.435664 1.421718
