program: Gaussian 09
title: 000253593
version: EM64L-G09RevD.01
frameworkgroup: C1[X(C21H16O)]
method: RPBEPBE
basis: SDD
operation: Freq
keyword: #pfreq=noraman
keyword: PBEPBE/SDD
title: #p freq=noraman PBEPBE/SDD
converged: YES YES NO NO
title: Mulliken charges:
elementType: O C C C C C C C C C C C C C C C C C C C C C H H H H H H H H H H H H H H H H
charge: -0.285807 0.114114 0.121948 0.104739 0.187582 0.301806 -0.379678 0.296084 -0.562176 0.475413 -0.374304 -0.417008 -0.408247 -0.378014 -0.375056 -0.815570 -0.238839 -0.227230 -0.239382 -0.234711 -0.247594 -0.249362 0.253825 0.256118 0.227216 0.254032 0.259967 0.259739 0.260712 0.231330 0.225585 0.230906 0.227550 0.229148 0.228892 0.227007 0.229783 0.229479
chargesum: 0.00000
title: Mulliken charges with hydrogens summed into heavy atoms:
elementType: O C C C C C C C C C C C C C C C C C C C C C
charge: -0.285807 0.114114 0.121948 0.104739 0.187582 0.301806 -0.125854 0.296084 -0.306058 0.475413 -0.147087 -0.162976 -0.148279 -0.118275 -0.114344 -0.127750 -0.011289 0.001918 -0.010489 -0.007705 -0.017811 -0.019883
polarizability: 3.53189391e+02 1.43174172e+01 2.79638685e+02 -6.46107948e+00 -1.48559564e+01 1.19711595e+02
1716.lowfreq: -6.2871 -1.0441 -0.0003 0.0005 0.0007 6.4759 31.1697 47.3273 49.6810
frequency: 31.0975 47.3170 49.6673 57.5772 64.2380 79.2408 96.6119 144.1122 189.3250 217.3833 257.8807 274.5088 278.0317 282.2830 319.0386 384.8646 401.3862 405.6933 408.2022 435.9254 479.7097 519.7796 522.5909 576.5296 599.6111 612.2543 614.1162 621.0322 671.4819 675.9322 683.5396 697.4575 705.4291 747.6233 753.1106 769.7773 777.2083 822.4705 851.0930 854.1782 859.0001 874.9763 914.9409 927.1225 928.6915 950.0173 958.9608 980.0985 982.7127 987.4625 988.7612 995.7036 997.2329 1000.4419 1015.1095 1029.0015 1041.3548 1045.1052 1079.5755 1085.9613 1115.5063 1143.1910 1172.4178 1172.5888 1175.9460 1190.2078 1195.8647 1213.7906 1269.0821 1286.9869 1315.0248 1325.2495 1364.6885 1372.7445 1379.4927 1385.8044 1397.3747 1425.7219 1434.0893 1439.1749 1469.5947 1470.6379 1473.2915 1489.0473 1498.6511 1571.8764 1578.5459 1587.0602 1588.2263 1613.9623 1615.0071 1631.0272 2975.9455 3053.2532 3085.8678 3123.6804 3124.6675 3126.7668 3130.4583 3137.6063 3143.0133 3150.9976 3154.9620 3156.5010 3159.9070 3165.4758 3167.2504 3173.9267
redmass: 3.7949 1.4775 3.6174 2.2116 4.6483 4.1778 4.4724 4.2130 4.5401 4.4524 5.2626 4.8763 4.6888 4.3311 5.0170 4.4305 2.8942 2.9966 4.1198 2.9610 3.9492 5.2192 4.3146 6.3722 3.7943 5.8134 6.4165 6.2551 6.0746 5.5556 5.9250 1.8008 1.8073 3.6859 6.1007 2.0408 2.0825 1.3998 1.3343 3.6751 1.2787 1.3595 3.5584 1.5376 1.4229 5.1213 1.3311 1.3901 1.3920 5.9308 5.9591 1.3252 1.3122 1.5890 4.0949 2.1543 2.3596 1.5355 1.6337 1.7755 2.3736 1.4849 1.4657 1.0552 1.7191 1.1211 1.1356 2.0260 3.0784 1.9905 1.4560 1.3871 3.5697 5.3087 5.8681 4.0539 1.2523 3.8853 2.3953 2.5532 1.0503 1.8536 1.4684 2.1877 3.0602 6.5788 6.0395 7.0386 7.6282 6.0948 6.3670 7.7004 1.0373 1.0976 1.0986 1.0851 1.0878 1.0850 1.0877 1.0894 1.0925 1.0967 1.0944 1.0945 1.0941 1.1015 1.0949 1.0992
irintensity: 0.2609 1.3388 0.3196 0.5028 0.0376 0.2203 0.2465 0.3033 0.3289 0.3297 0.1610 0.5312 0.6554 0.6291 0.4898 1.8063 0.3988 0.3380 1.2005 5.7601 1.4115 5.6492 5.7873 5.0590 12.9362 5.1959 0.5319 4.3001 7.8578 3.0198 5.1840 56.6839 38.5576 4.8400 10.8432 65.4608 24.9898 42.0011 1.9601 5.7013 1.6325 10.6239 10.2015 3.3589 2.1090 26.2502 0.3634 1.2880 0.3117 0.1742 0.4453 0.2533 0.1743 8.0012 45.7939 1.9653 17.6459 12.3927 9.1609 8.4070 7.2914 2.8544 4.9514 0.0392 9.5730 0.3892 1.8443 3.6109 4.3335 3.8816 0.5568 0.8104 3.9853 3.1258 2.6158 14.1834 9.8410 2.5120 7.5701 6.1083 13.5530 35.2998 18.2484 10.7132 19.7795 4.2737 4.7056 1.5605 4.1094 15.0648 16.1171 14.7342 50.6221 20.7064 18.3133 5.8974 16.4327 1.2263 2.2858 11.9027 24.5486 29.7144 33.9008 13.7365 7.4135 17.8176 19.1212 11.8136
temp: 298.150 k
press: 1.00000 atm
elementType: 8 6 6 6 6 6 6 6 6 6 6 6 6 6 6 6 6 6 6 6 6 6 1 1 1 1 1 1 1 1 1 1 1 1 1 1 1 1
symmnumber: 1
zpe: 789617.2 jmol-1
zpe.correction: 0.300749 hartree
zpe.thermalcorrener: 0.318482 hartree
zpe.thermalcorrenthalpy: 0.319427 hartree
zpe.thermalcorrgfe: 0.253568 hartree
zpe.sumelectzpe: -883.579337 hartree
zpe.sumelectthermal: -883.561604 hartree
zpe.sumelectthermalent: -883.560660 hartree
zpe.sumelectthermalfe: -883.626518 hartree
dipole: 0.2002 0.9006 0.0849
dipole: 0.9265
quadrupole: -107.2923 -114.4758 -131.1143
quadrupole: -1.5068 -1.9955 -4.2816
quadrupole: 10.3352 3.1517 -13.4869 -1.5068 -1.9955 -4.2816
hfenergy: -883.8800864 hartree
pointgroup: C01 [X(C21H16O1)]
dipole: 0.0653602 0.356757 -0.0362156 debye
polarizability: 351.6176067|14.5809036|269.3519375|-13.4927632|-44.2766981|131.5701264 unknown
InChI: InChI=1S/C21H16O/c1-15-12-13-18-19(14-15)22-21(17-10-6-3-7-11-17)20(18)16-8-4-2-5-9-16/h2-14H,1H3
charge 0 multiplicity 1
38 atoms
O  0.810619 -1.818179 0.344537
C  0.191005 0.379144 -0.083532
C  1.649918 0.290134 -0.097973
C  -0.285847 -0.910788 0.174191
C  1.984095 -1.064097 0.171611
C  -0.573121 1.638627 -0.24742
C  2.709829 1.217576 -0.271754
C  -1.607176 -1.539822 0.264689
C  3.294495 -1.55384 0.256559
C  4.347088 -0.625784 0.065696
C  4.03464 0.747394 -0.190423
C  -0.266108 2.525538 -1.31655
C  -1.584559 2.018749 0.677696
C  -2.760932 -0.945932 -0.32282
C  -1.747515 -2.794079 0.926885
C  5.797705 -1.072282 0.136374
C  -0.957212 3.748128 -1.463836
C  -2.274957 3.240406 0.530065
C  -4.016215 -1.580045 -0.231081
C  -3.005596 -3.423777 1.013146
C  -1.965178 4.111728 -0.541336
C  -4.1487 -2.819403 0.439301
H  2.504397 2.276898 -0.454723
H  3.494684 -2.609341 0.463783
H  4.862741 1.454139 -0.324529
H  0.498651 2.239275 -2.047385
H  -1.817808 1.35584 1.518147
H  -2.671866 0.001852 -0.861156
H  -0.86245 -3.264096 1.365619
H  6.34273 -0.539481 0.938372
H  5.880401 -2.154377 0.334909
H  6.328548 -0.862079 -0.811285
H  -0.711714 4.413422 -2.29929
H  -3.04861 3.516553 1.255363
H  -4.89183 -1.110307 -0.692818
H  -3.094684 -4.386819 1.528157
H  -2.50052 5.061123 -0.65319
H  -5.126443 -3.308996 0.507098
