program: Gaussian 09
title: 000250716
version: EM64L-G09RevD.01
frameworkgroup: C1[X(C7H8N4O3)]
method: RPBEPBE
basis: SDD
operation: Freq
keyword: #pfreq=noraman
keyword: PBEPBE/SDD
title: #p freq=noraman PBEPBE/SDD
converged: YES YES NO NO
title: Mulliken charges:
elementType: O O O N N N N C C C C C C C H H H H H H H H
charge: -0.245939 -0.199398 -0.225577 -0.228212 -0.405440 -0.617121 -0.057346 0.393320 -0.467421 0.217994 -0.063761 0.168570 -0.036626 -0.579809 0.287572 0.251405 0.366068 0.256302 0.368020 0.351653 0.236125 0.229619
chargesum: 0.00000
title: Mulliken charges with hydrogens summed into heavy atoms:
elementType: O O O N N N N C C C C C C C
charge: -0.245939 -0.199398 -0.225577 -0.228212 -0.039372 0.102552 -0.057346 0.393320 0.071556 0.217994 -0.063761 0.168570 0.219676 -0.114065
polarizability: 1.75252706e+02 -1.06360583e+00 1.32583153e+02 6.31543482e+00 2.78319097e+00 5.99225550e+01
1716.lowfreq: 0.0009 0.0009 0.0013 5.2861 7.1858 8.3908 58.0899 73.5665 84.5894
frequency: 58.0859 73.5554 84.5798 101.2640 159.0040 182.4527 208.1082 220.0095 286.7711 302.4988 329.5570 347.9020 382.3907 388.9096 405.4486 494.8343 530.8786 564.9823 589.2302 629.8017 639.7222 683.5766 706.0206 727.6268 752.1201 769.5354 810.9549 842.5864 925.3721 934.3148 969.5501 1009.4834 1060.1543 1095.3420 1136.0851 1152.1242 1201.7755 1233.4604 1281.6829 1293.6335 1317.7874 1341.0922 1359.7094 1371.0295 1429.9317 1455.3957 1508.6268 1531.2598 1596.8267 1643.7857 1650.2469 1661.6219 2996.6515 3056.8694 3090.0754 3115.6026 3204.8541 3371.0698 3514.8019 3593.8638
redmass: 7.1610 8.2941 3.5363 2.5507 9.5095 3.6481 7.9622 8.9752 3.8687 6.2860 3.9647 5.2320 4.2124 5.2881 5.9469 4.0056 3.4627 1.1548 4.9690 2.4598 3.0076 3.6198 5.3512 3.3347 5.9429 2.6771 1.1827 2.6371 1.7016 2.3193 1.3399 1.1334 4.1244 3.2263 2.0972 2.3516 7.4330 4.7818 1.3408 1.6007 4.0224 1.7134 2.9311 1.7743 1.1976 1.1241 1.7481 5.0506 2.3923 9.4060 4.5210 6.3680 1.0589 1.1026 1.0619 1.0943 1.1134 1.0528 1.0772 1.0969
irintensity: 0.2514 2.8417 0.5369 0.7324 4.6892 0.6196 3.8154 0.3175 1.5219 5.2582 5.3627 18.0197 6.6286 5.3452 6.5035 15.2901 22.1830 102.5768 16.9567 7.4117 10.4658 28.2901 6.2610 23.5479 2.7586 103.6434 132.2281 11.1470 12.7478 24.3734 79.4836 25.5686 5.2188 4.6470 21.9264 8.4065 10.4883 152.6240 9.2731 89.0731 387.1552 31.5523 14.3406 27.1604 13.8670 16.9118 29.8087 265.1790 509.7431 183.8182 37.0785 613.8935 28.4645 15.4927 5.5747 4.7467 13.2782 59.0233 66.1557 204.5102
temp: 298.150 k
press: 1.00000 atm
elementType: 8 8 8 7 7 7 7 6 6 6 6 6 6 6 1 1 1 1 1 1 1 1
symmnumber: 1
zpe: 414963.5 jmol-1
zpe.correction: 0.158051 hartree
zpe.thermalcorrener: 0.170943 hartree
zpe.thermalcorrenthalpy: 0.171887 hartree
zpe.thermalcorrgfe: 0.118557 hartree
zpe.sumelectzpe: -715.146423 hartree
zpe.sumelectthermal: -715.133531 hartree
zpe.sumelectthermalent: -715.132587 hartree
zpe.sumelectthermalfe: -715.185917 hartree
dipole: -8.6303 -1.5438 -0.5637
dipole: 8.7854
quadrupole: -97.5840 -85.3778 -77.9148
quadrupole: 16.6910 -0.8246 0.8294
quadrupole: -10.6252 1.5811 9.0441 16.6910 -0.8246 0.8294
hfenergy: -715.3044739 hartree
pointgroup: C01 [X(C7H8N4O3)]
dipole: 3.3458196 -0.8547013 0.1483471 debye
dipolederiv: -0.9425068 -0.3326518 -0.0318759 -0.4112059 -1.0640572 -0.0362827 -0.0513598 -0.0104155 -0.3564139 -1.0424635 0.3186703 -0.0504997 0.3019678 -0.5788431 0.0247217 -0.0671335 0.0388135 -0.34206 -1.0513986 -0.6385163 -0.0474854 -0.0570643 -0.2707831 -0.0043291 -0.0689988 -0.0486735 -0.1641242 -0.9414869 -0.031728 -0.0042382 -0.4254651 -1.3389702 -0.0178469 0.0350455 -0.0123894 -0.2056864 -1.3293151 -0.2384805 -0.0627106 -0.2564818 -0.5684064 -0.0196462 -0.0799497 -0.0023078 -0.359291 -0.7707443 0.3485923 -0.0471648 0.4825609 -0.9746801 0.0861029 -0.0717828 0.1427766 -0.5439937 0.9537018 0.8899442 0.0662921 0.6850467 0.5115545 0.0458846 0.0848083 0.0691942 -0.1596597 1.740836 0.0954201 0.1087514 -0.0608742 1.193185 -0.0569355 0.1178646 -0.0228319 0.2371182 0.728379 -0.1659456 0.0059366 0.1041722 -0.0533941 -0.0758706 0.0661077 -0.0401285 0.2054868 1.4804659 0.0793205 0.093359 0.2181316 1.8243426 0.0061049 0.0975565 -0.0300658 0.3046155 -1.1422007 0.0431809 -0.0761367 -0.4048253 -1.0450107 -0.0080038 -0.0980536 0.0028208 -0.05936 1.5170969 -0.2525953 0.0776684 0.0436917 1.3293653 -0.0245639 0.086982 -0.0631718 0.3278692 -0.1556335 -0.119095 -0.0638268 -0.2574561 0.0773101 0.0005379 -0.1887559 0.0511637 0.1232827 -0.3381493 -0.1281061 0.0111563 -0.1010594 -0.2579114 -0.0243003 0.0550008 -0.0231912 0.0927235 0.1026227 0.0375756 0.0262384 -0.1596782 0.1205854 -0.0234792 0.0607188 -0.0264069 0.1093704 -0.0320019 0.0313407 0.007016 0.0704233 0.063243 0.1182325 0.0017927 0.0369495 -0.0538445 0.148393 -0.0293917 -0.0143029 -0.0725701 0.2080524 -0.0001901 -0.0114509 0.0006373 0.3358635 0.14204 0.0441378 -0.037875 0.0720003 0.0634245 0.0482528 0.0030977 0.015268 -0.0601939 0.2954743 -0.0517492 0.0083136 0.0173492 0.2982292 -0.0161252 0.0152835 -0.0382302 0.3181368 0.3856491 -0.0236979 -0.0299897 0.0536596 0.2328441 -0.0096658 -0.0277759 -0.0448184 0.3394873 0.0919453 0.0799327 0.0650355 0.1095466 0.1027877 -0.0438344 0.0701423 -0.05072 -0.0030191 0.1592966 0.0438423 -0.0036614 0.0481306 0.1271325 0.0312361 -0.0291397 0.0557272 -0.0863074 unknown
polarizability: 175.3159099|-2.2078011|132.7881645|4.6406495|-0.3279864|59.6543396 unknown
InChI: InChI=1S/C7H8N4O3/c1-2-3-11-5(8)4(10-14)6(12)9-7(11)13/h2,9H,1,3,8H2
charge 0 multiplicity 1
22 atoms
O  1.248724 2.683565 0.208838
O  -3.164372 1.229535 -0.123591
O  -3.424384 -1.695273 -0.075937
N  0.876994 0.35935 0.246387
N  -0.937463 1.883125 0.022677
N  0.455554 -1.976118 0.275681
N  -2.137934 -1.711115 0.020483
C  -0.013437 -0.703973 0.191151
C  2.332437 0.147086 0.4923
C  0.432323 1.725941 0.158809
C  -1.42807 -0.491593 0.06735
C  -1.966625 0.866243 -0.015946
C  3.037813 -0.610509 -0.617272
C  3.93035 -1.609799 -0.401054
H  2.752335 1.166983 0.572631
H  2.46674 -0.35732 1.467818
H  -1.273248 2.850257 -0.041126
H  2.826644 -0.266675 -1.639601
H  -0.289358 -2.687048 0.22259
H  1.443274 -2.208151 0.174197
H  4.4646 -2.08498 -1.229877
H  4.178101 -1.958631 0.610391
