program: Gaussian 09
title: 000253576
version: EM64L-G09RevD.01
frameworkgroup: C1[X(C16H16S)]
method: RPBEPBE
basis: SDD
operation: Freq
keyword: #pfreq=noraman
keyword: PBEPBE/SDD
title: #p freq=noraman PBEPBE/SDD
converged: YES YES NO NO
title: Mulliken charges:
elementType: S C C C C C C C C C C C C C C C C H H H H H H H H H H H H H H H H
charge: 0.178239 -0.481811 -0.545588 -0.486481 0.300409 0.294899 -0.429507 -0.431636 -0.230127 -0.229855 -0.173979 -0.219044 -0.252432 0.444242 -0.376647 -0.381906 -0.803914 0.287183 0.238290 0.237790 0.240969 0.238438 0.240736 0.240988 0.224883 0.224459 0.246881 0.252007 0.231542 0.232205 0.226169 0.236303 0.226295
chargesum: 0.00000
title: Mulliken charges with hydrogens summed into heavy atoms:
elementType: S C C C C C C C C C C C C C C C C
charge: 0.178239 -0.194628 -0.069509 -0.007074 0.300409 0.294899 -0.188771 -0.190648 -0.005244 -0.005396 -0.173979 0.027836 -0.000426 0.444242 -0.145105 -0.149700 -0.115146
polarizability: 2.60126575e+02 1.92579992e+01 1.64047171e+02 -6.72615423e+00 -9.21248452e+00 1.33472056e+02
1716.lowfreq: -11.4823 -6.3238 -0.0014 0.0009 0.0020 2.3693 16.0316 21.7296 25.8678
frequency: 15.0624 21.6315 24.7741 34.6338 76.3853 116.8201 176.5103 185.7051 231.3343 240.2334 273.8922 331.4565 357.3147 372.9129 405.6453 409.5201 419.2245 466.4953 498.8611 513.1589 571.6989 579.9190 609.7344 631.9207 709.3762 712.8810 729.8807 750.9886 787.3936 797.2014 822.3896 840.7483 848.5306 868.2262 910.1859 912.5964 935.6833 954.4644 974.5621 984.9538 985.5540 1003.8348 1006.4722 1022.6167 1047.0702 1054.6686 1076.9664 1099.5157 1113.4332 1125.1073 1164.7347 1169.7074 1171.9110 1186.3197 1213.3458 1219.7203 1226.1105 1244.1230 1285.6119 1292.2588 1295.8734 1299.3702 1359.0708 1388.7126 1392.1295 1397.7743 1446.4660 1456.5047 1461.2946 1470.1856 1473.5016 1475.5734 1479.4957 1575.2227 1595.2511 1604.9923 1618.2975 2969.1136 2975.3919 2981.2617 3033.0965 3056.6055 3059.2989 3067.7237 3085.8043 3118.8211 3120.8097 3123.6424 3125.8998 3139.5885 3148.1970 3155.6844 3158.9752
redmass: 3.1415 1.4393 2.2685 3.8473 4.4337 4.2652 4.2791 2.6775 4.2352 4.3754 4.0731 4.2847 2.8062 7.3849 2.7995 2.6696 3.3726 2.7279 2.9841 2.9010 5.7395 6.0982 5.6674 6.9655 3.2352 3.3653 4.4407 1.2642 4.8778 3.9515 1.4001 4.7221 1.2442 1.2998 2.4897 1.5465 1.4182 1.3048 1.3768 1.4083 1.3162 3.7703 1.9416 2.1977 1.5645 3.8957 2.9570 1.9285 1.3105 1.2819 1.1755 1.0705 2.4717 1.1197 1.5890 2.9046 1.2989 1.7039 1.6775 1.2999 1.2474 1.4330 4.9060 6.2946 3.2680 1.2247 2.3498 1.1125 1.3059 1.0901 1.0545 1.9629 2.4884 6.1933 6.7169 6.2461 7.1616 1.0669 1.0388 1.0656 1.0857 1.0948 1.0954 1.0971 1.0998 1.0852 1.0882 1.0887 1.0895 1.0946 1.0958 1.0964 1.1003
irintensity: 0.2614 0.4579 0.0970 0.0973 0.1605 0.9194 0.4381 0.0390 3.5983 2.8104 2.3289 0.5976 0.6149 0.2360 1.2413 4.5510 3.7305 3.7735 2.1888 26.9002 2.8317 1.0539 3.8222 0.0206 0.2539 2.5118 15.0650 75.7096 4.9101 10.2782 58.1846 0.6705 1.1001 0.3154 8.2391 1.2504 0.4478 0.8866 0.1697 0.2106 0.0144 15.7038 6.6539 7.3636 16.8271 0.8263 4.0959 5.2416 11.6014 0.1453 5.9910 0.2558 0.5892 3.7312 1.5868 2.9117 8.0686 0.1493 32.5229 2.2583 0.8435 2.2362 0.1338 4.0684 3.0606 11.3825 2.5925 13.2636 15.2105 13.3190 12.9061 21.6527 44.7075 0.4597 2.8140 1.3020 0.3715 19.3462 37.1530 14.3537 4.6514 24.1032 19.1721 23.0622 17.5092 2.9181 12.4596 20.8630 3.3249 34.7643 18.9960 3.1378 39.3883
temp: 298.150 k
press: 1.00000 atm
elementType: 16 6 6 6 6 6 6 6 6 6 6 6 6 6 6 6 6 1 1 1 1 1 1 1 1 1 1 1 1 1 1 1 1
symmnumber: 1
zpe: 705339.9 jmol-1
zpe.correction: 0.268650 hartree
zpe.thermalcorrener: 0.284163 hartree
zpe.thermalcorrenthalpy: 0.285107 hartree
zpe.thermalcorrgfe: 0.222005 hartree
zpe.sumelectzpe: -1016.164490 hartree
zpe.sumelectthermal: -1016.148976 hartree
zpe.sumelectthermalent: -1016.148032 hartree
zpe.sumelectthermalfe: -1016.211135 hartree
dipole: 0.7105 1.8719 0.7482
dipole: 2.1374
quadrupole: -95.3365 -107.4832 -104.9819
quadrupole: 7.8736 -0.2380 -3.9518
quadrupole: 7.2640 -4.8826 -2.3814 7.8736 -0.2380 -3.9518
hfenergy: -1016.4331394 hartree
pointgroup: C01 [X(C16H16S1)]
dipole: 0.2728058 0.7513398 0.2612178 debye
polarizability: 260.1272764|19.4796943|163.2400846|-6.006704|-10.4584721|134.2784403 unknown
InChI: InChI=1S/C16H16S/c1-12-6-8-15(9-7-12)17-16-10-13-4-2-3-5-14(13)11-16/h2-9,16H,10-11H2,1H3
charge 0 multiplicity 1
33 atoms
S  0.718546 -2.04723 -0.43694
C  -0.671438 -0.935755 0.237122
C  -2.01906 -1.713901 0.267965
C  -0.952066 0.340894 -0.606745
C  -3.04399 -0.589397 0.166734
C  -2.430897 0.592217 -0.332133
C  -4.418453 -0.609058 0.473481
C  -3.189741 1.763256 -0.52488
C  -5.183072 0.568972 0.280316
C  -4.573078 1.746414 -0.215002
C  2.16997 -0.937582 -0.162108
C  2.670267 -0.713802 1.142379
C  2.816816 -0.340855 -1.26879
C  4.45606 0.726438 0.235078
C  3.796859 0.116038 1.334687
C  3.95307 0.475809 -1.067556
C  5.652653 1.636965 0.449762
H  -0.380273 -0.648772 1.263052
H  -2.126664 -2.338244 1.171621
H  -2.096069 -2.387107 -0.611282
H  -0.784557 0.125551 -1.681403
H  -0.294466 1.183632 -0.332301
H  -4.893587 -1.517981 0.86095
H  -2.720643 2.678271 -0.90523
H  -6.252435 0.57069 0.520507
H  -5.174653 2.651791 -0.35518
H  2.190486 -1.20112 1.998432
H  2.433015 -0.519351 -2.278706
H  4.176278 0.28126 2.350582
H  4.451001 0.927256 -1.934422
H  6.325435 1.636688 -0.425744
H  5.330023 2.683457 0.615714
H  6.241261 1.332859 1.333341
